{"text_format":"1","workbook":"xlsx","n_sheets":4,"sheets":["Comentarios","Contenido RETSIT gral","Contenido RETSIT esp","Hoja1"],"not_rendered":{"charts":0,"images":0,"macros":1,"external_links":0,"defined_names":1,"comments":0,"pivot_tables":0},"unopened":[],"bounds":{"document_bytes":16777216,"sheet_cells":100000,"rows_first":2000,"rows_last":500,"rows_between":2000,"halvings":0,"cell_chars":16384,"cell_head_chars":4096},"cells_cut":0,"cells_raw":0,"read":"whole","date_system":"1900"}

{"sheet":"Comentarios","index":0,"n_rows":101,"n_cols":7,"rows_kept":101,"cut":false,"hidden":false,"merged":[[13,0,13,6],[14,1,14,6],[15,1,15,6],[16,0,16,6],[4,1,4,6],[8,0,8,6],[9,1,9,6],[10,1,10,6],[11,1,11,6],[12,1,12,6],[1,0,2,6],[3,1,3,6],[5,1,5,6],[6,1,6,6],[7,1,7,6]]}
[]
["FORMULARIO PARA RECEPCIÓN DE COMENTARIOS DE LA CIUDADANÍA Y PARTES INTERESADAS"]
[]
["Sector: ","Energía"]
["Proyecto: Resolución","\"Por la cual se expide el nuevo Reglamento Técnico de Instalaciones Térmicas - RETSIT\""]
["Fecha inicio:","25 de abril de 2023"]
["Fecha  fin: ","09 de mayo de 2023"]
["Fecha Comentario: "]
["Datos de contacto"]
["Nombre:"]
["Empresa:"]
["Correo electrónico:"]
["Telefono:"]
[]
["NOTA 1","En los casos que su comentario sea ajustar, modificar o eliminar algún ítem de la propuesta presentada, sugerimos incluir su debida justificación técnica"]
["NOTA 2","Favor incluir solo texto, en caso de considerar necesario el envío de información adicional como gráficos o tablas, agradecemos enviarlo al correo electrónico pciudadana@minenergia.gov.co indicando en el asunto: \"Comentarios al Proyecto de Resolución por la cual se expide el nuevo Reglamento Técnico de Instalaciones Térmicas - RETSIT\""]
[]
["TIPO DE COMENTARIO\n\n\n(De la lista desplegable seleccione si su comentario es Editorial o Técnico)","1er REFERENTE DEL ACTO ADMINISTRATIVO\n\n(De la lista desplegable seleccione alguno de los Anexos, la Resolución, o la Memoria Justificativa)","TEMA DE OBSERVACIÓN DEL 1er REFERENTE DEL ACTO ADMINISTRATIVO","2do REFERENTE DEL ACTO ADMINISTRATIVO\n\n(De la lista desplegable seleccione el Título, Artículo, Númeral, o Capítulo del que hará el comentario) ","TEMA DE OBSERVACIÓN DEL 2do REFERENTE DEL ACTO ADMINISTRATIVO","Comentario detallado y Propuesta de Modificación\n(Ver Notas 1 y 2)","Justificación normativa"]
[null,null,{"$f":"IFERROR(VLOOKUP(B19,'Contenido RETSIT esp'!$A$2:$B$145,2,FALSE),\"\")","v":""},null,{"$f":"+_xlfn.IFNA(+IF(B19=\"ANEXO1\",VLOOKUP(D19,'Contenido RETSIT esp'!$A$3:$B$24,2,FALSE),IF(B19=\"ANEXO2\",VLOOKUP(D19,'Contenido RETSIT esp'!$A$26:$B$98,2,FALSE),IF(B19=\"ANEXO3\",VLOOKUP(D19,'Contenido RETSIT esp'!$A$100:$B$105,2,FALSE),IF(B19=\"ANEXO4\",VLOOKUP(D19,'Contenido RETSIT esp'!#REF!,2,FALSE),IF(B19=\"RESOLUCIÓN\",VLOOKUP(D19,'Contenido RETSIT esp'!$A$107:$B$114,2,FALSE),IF(B19=\"MEMORIAJUSTIFICATIVA\",VLOOKUP(D19,'Contenido RETSIT esp'!$A$114:$B$145,2,FALSE),\"\")))))),\"\")","v":""}]
[null,null,{"$f":"IFERROR(VLOOKUP(B20,'Contenido RETSIT esp'!$A$2:$B$145,2,FALSE),\"\")","v":""},null,{"$f":"+_xlfn.IFNA(+IF(B20=\"ANEXO1\",VLOOKUP(D20,'Contenido RETSIT esp'!$A$3:$B$24,2,FALSE),IF(B20=\"ANEXO2\",VLOOKUP(D20,'Contenido RETSIT esp'!$A$26:$B$98,2,FALSE),IF(B20=\"ANEXO3\",VLOOKUP(D20,'Contenido RETSIT esp'!$A$100:$B$105,2,FALSE),IF(B20=\"ANEXO4\",VLOOKUP(D20,'Contenido RETSIT esp'!#REF!,2,FALSE),IF(B20=\"RESOLUCIÓN\",VLOOKUP(D20,'Contenido RETSIT esp'!$A$107:$B$114,2,FALSE),IF(B20=\"MEMORIAJUSTIFICATIVA\",VLOOKUP(D20,'Contenido RETSIT esp'!$A$114:$B$145,2,FALSE),\"\")))))),\"\")","v":""}]
[null,null,{"$f":"IFERROR(VLOOKUP(B21,'Contenido RETSIT esp'!$A$2:$B$145,2,FALSE),\"\")","v":""},null,{"$f":"+_xlfn.IFNA(+IF(B21=\"ANEXO1\",VLOOKUP(D21,'Contenido RETSIT esp'!$A$3:$B$24,2,FALSE),IF(B21=\"ANEXO2\",VLOOKUP(D21,'Contenido RETSIT esp'!$A$26:$B$98,2,FALSE),IF(B21=\"ANEXO3\",VLOOKUP(D21,'Contenido RETSIT esp'!$A$100:$B$105,2,FALSE),IF(B21=\"ANEXO4\",VLOOKUP(D21,'Contenido RETSIT esp'!#REF!,2,FALSE),IF(B21=\"RESOLUCIÓN\",VLOOKUP(D21,'Contenido RETSIT esp'!$A$107:$B$114,2,FALSE),IF(B21=\"MEMORIAJUSTIFICATIVA\",VLOOKUP(D21,'Contenido RETSIT esp'!$A$114:$B$145,2,FALSE),\"\")))))),\"\")","v":""}]
[null,null,{"$f":"IFERROR(VLOOKUP(B22,'Contenido RETSIT esp'!$A$2:$B$145,2,FALSE),\"\")","v":""},null,{"$f":"+_xlfn.IFNA(+IF(B22=\"ANEXO1\",VLOOKUP(D22,'Contenido RETSIT esp'!$A$3:$B$24,2,FALSE),IF(B22=\"ANEXO2\",VLOOKUP(D22,'Contenido RETSIT esp'!$A$26:$B$98,2,FALSE),IF(B22=\"ANEXO3\",VLOOKUP(D22,'Contenido RETSIT esp'!$A$100:$B$105,2,FALSE),IF(B22=\"ANEXO4\",VLOOKUP(D22,'Contenido RETSIT esp'!#REF!,2,FALSE),IF(B22=\"RESOLUCIÓN\",VLOOKUP(D22,'Contenido RETSIT esp'!$A$107:$B$114,2,FALSE),IF(B22=\"MEMORIAJUSTIFICATIVA\",VLOOKUP(D22,'Contenido RETSIT esp'!$A$114:$B$145,2,FALSE),\"\")))))),\"\")","v":""}]
[null,null,{"$f":"IFERROR(VLOOKUP(B23,'Contenido RETSIT esp'!$A$2:$B$145,2,FALSE),\"\")","v":""},null,{"$f":"+_xlfn.IFNA(+IF(B23=\"ANEXO1\",VLOOKUP(D23,'Contenido RETSIT esp'!$A$3:$B$24,2,FALSE),IF(B23=\"ANEXO2\",VLOOKUP(D23,'Contenido RETSIT esp'!$A$26:$B$98,2,FALSE),IF(B23=\"ANEXO3\",VLOOKUP(D23,'Contenido RETSIT esp'!$A$100:$B$105,2,FALSE),IF(B23=\"ANEXO4\",VLOOKUP(D23,'Contenido RETSIT esp'!#REF!,2,FALSE),IF(B23=\"RESOLUCIÓN\",VLOOKUP(D23,'Contenido RETSIT esp'!$A$107:$B$114,2,FALSE),IF(B23=\"MEMORIAJUSTIFICATIVA\",VLOOKUP(D23,'Contenido RETSIT esp'!$A$114:$B$145,2,FALSE),\"\")))))),\"\")","v":""}]
[null,null,{"$f":"IFERROR(VLOOKUP(B24,'Contenido RETSIT esp'!$A$2:$B$145,2,FALSE),\"\")","v":""},null,{"$f":"+_xlfn.IFNA(+IF(B24=\"ANEXO1\",VLOOKUP(D24,'Contenido RETSIT esp'!$A$3:$B$24,2,FALSE),IF(B24=\"ANEXO2\",VLOOKUP(D24,'Contenido RETSIT esp'!$A$26:$B$98,2,FALSE),IF(B24=\"ANEXO3\",VLOOKUP(D24,'Contenido RETSIT esp'!$A$100:$B$105,2,FALSE),IF(B24=\"ANEXO4\",VLOOKUP(D24,'Contenido RETSIT esp'!#REF!,2,FALSE),IF(B24=\"RESOLUCIÓN\",VLOOKUP(D24,'Contenido RETSIT esp'!$A$107:$B$114,2,FALSE),IF(B24=\"MEMORIAJUSTIFICATIVA\",VLOOKUP(D24,'Contenido RETSIT esp'!$A$114:$B$145,2,FALSE),\"\")))))),\"\")","v":""}]
[null,null,{"$f":"IFERROR(VLOOKUP(B25,'Contenido RETSIT esp'!$A$2:$B$145,2,FALSE),\"\")","v":""},null,{"$f":"+_xlfn.IFNA(+IF(B25=\"ANEXO1\",VLOOKUP(D25,'Contenido RETSIT esp'!$A$3:$B$24,2,FALSE),IF(B25=\"ANEXO2\",VLOOKUP(D25,'Contenido RETSIT esp'!$A$26:$B$98,2,FALSE),IF(B25=\"ANEXO3\",VLOOKUP(D25,'Contenido RETSIT esp'!$A$100:$B$105,2,FALSE),IF(B25=\"ANEXO4\",VLOOKUP(D25,'Contenido RETSIT esp'!#REF!,2,FALSE),IF(B25=\"RESOLUCIÓN\",VLOOKUP(D25,'Contenido RETSIT esp'!$A$107:$B$114,2,FALSE),IF(B25=\"MEMORIAJUSTIFICATIVA\",VLOOKUP(D25,'Contenido RETSIT esp'!$A$114:$B$145,2,FALSE),\"\")))))),\"\")","v":""}]
[null,null,{"$f":"IFERROR(VLOOKUP(B26,'Contenido RETSIT esp'!$A$2:$B$145,2,FALSE),\"\")","v":""},null,{"$f":"+_xlfn.IFNA(+IF(B26=\"ANEXO1\",VLOOKUP(D26,'Contenido RETSIT esp'!$A$3:$B$24,2,FALSE),IF(B26=\"ANEXO2\",VLOOKUP(D26,'Contenido RETSIT esp'!$A$26:$B$98,2,FALSE),IF(B26=\"ANEXO3\",VLOOKUP(D26,'Contenido RETSIT esp'!$A$100:$B$105,2,FALSE),IF(B26=\"ANEXO4\",VLOOKUP(D26,'Contenido RETSIT esp'!#REF!,2,FALSE),IF(B26=\"RESOLUCIÓN\",VLOOKUP(D26,'Contenido RETSIT esp'!$A$107:$B$114,2,FALSE),IF(B26=\"MEMORIAJUSTIFICATIVA\",VLOOKUP(D26,'Contenido RETSIT esp'!$A$114:$B$145,2,FALSE),\"\")))))),\"\")","v":""}]
[null,null,{"$f":"IFERROR(VLOOKUP(B27,'Contenido RETSIT esp'!$A$2:$B$145,2,FALSE),\"\")","v":""},null,{"$f":"+_xlfn.IFNA(+IF(B27=\"ANEXO1\",VLOOKUP(D27,'Contenido RETSIT esp'!$A$3:$B$24,2,FALSE),IF(B27=\"ANEXO2\",VLOOKUP(D27,'Contenido RETSIT esp'!$A$26:$B$98,2,FALSE),IF(B27=\"ANEXO3\",VLOOKUP(D27,'Contenido RETSIT esp'!$A$100:$B$105,2,FALSE),IF(B27=\"ANEXO4\",VLOOKUP(D27,'Contenido RETSIT esp'!#REF!,2,FALSE),IF(B27=\"RESOLUCIÓN\",VLOOKUP(D27,'Contenido RETSIT esp'!$A$107:$B$114,2,FALSE),IF(B27=\"MEMORIAJUSTIFICATIVA\",VLOOKUP(D27,'Contenido RETSIT esp'!$A$114:$B$145,2,FALSE),\"\")))))),\"\")","v":""}]
[null,null,{"$f":"IFERROR(VLOOKUP(B28,'Contenido RETSIT esp'!$A$2:$B$145,2,FALSE),\"\")","v":""},null,{"$f":"+_xlfn.IFNA(+IF(B28=\"ANEXO1\",VLOOKUP(D28,'Contenido RETSIT esp'!$A$3:$B$24,2,FALSE),IF(B28=\"ANEXO2\",VLOOKUP(D28,'Contenido RETSIT esp'!$A$26:$B$98,2,FALSE),IF(B28=\"ANEXO3\",VLOOKUP(D28,'Contenido RETSIT esp'!$A$100:$B$105,2,FALSE),IF(B28=\"ANEXO4\",VLOOKUP(D28,'Contenido RETSIT esp'!#REF!,2,FALSE),IF(B28=\"RESOLUCIÓN\",VLOOKUP(D28,'Contenido RETSIT esp'!$A$107:$B$114,2,FALSE),IF(B28=\"MEMORIAJUSTIFICATIVA\",VLOOKUP(D28,'Contenido RETSIT esp'!$A$114:$B$145,2,FALSE),\"\")))))),\"\")","v":""}]
[null,null,{"$f":"IFERROR(VLOOKUP(B29,'Contenido RETSIT esp'!$A$2:$B$145,2,FALSE),\"\")","v":""},null,{"$f":"+_xlfn.IFNA(+IF(B29=\"ANEXO1\",VLOOKUP(D29,'Contenido RETSIT esp'!$A$3:$B$24,2,FALSE),IF(B29=\"ANEXO2\",VLOOKUP(D29,'Contenido RETSIT esp'!$A$26:$B$98,2,FALSE),IF(B29=\"ANEXO3\",VLOOKUP(D29,'Contenido RETSIT esp'!$A$100:$B$105,2,FALSE),IF(B29=\"ANEXO4\",VLOOKUP(D29,'Contenido RETSIT esp'!#REF!,2,FALSE),IF(B29=\"RESOLUCIÓN\",VLOOKUP(D29,'Contenido RETSIT esp'!$A$107:$B$114,2,FALSE),IF(B29=\"MEMORIAJUSTIFICATIVA\",VLOOKUP(D29,'Contenido RETSIT esp'!$A$114:$B$145,2,FALSE),\"\")))))),\"\")","v":""}]
[null,null,{"$f":"IFERROR(VLOOKUP(B30,'Contenido RETSIT esp'!$A$2:$B$145,2,FALSE),\"\")","v":""},null,{"$f":"+_xlfn.IFNA(+IF(B30=\"ANEXO1\",VLOOKUP(D30,'Contenido RETSIT esp'!$A$3:$B$24,2,FALSE),IF(B30=\"ANEXO2\",VLOOKUP(D30,'Contenido RETSIT esp'!$A$26:$B$98,2,FALSE),IF(B30=\"ANEXO3\",VLOOKUP(D30,'Contenido RETSIT esp'!$A$100:$B$105,2,FALSE),IF(B30=\"ANEXO4\",VLOOKUP(D30,'Contenido RETSIT esp'!#REF!,2,FALSE),IF(B30=\"RESOLUCIÓN\",VLOOKUP(D30,'Contenido RETSIT esp'!$A$107:$B$114,2,FALSE),IF(B30=\"MEMORIAJUSTIFICATIVA\",VLOOKUP(D30,'Contenido RETSIT esp'!$A$114:$B$145,2,FALSE),\"\")))))),\"\")","v":""}]
[null,null,{"$f":"IFERROR(VLOOKUP(B31,'Contenido RETSIT esp'!$A$2:$B$145,2,FALSE),\"\")","v":""},null,{"$f":"+_xlfn.IFNA(+IF(B31=\"ANEXO1\",VLOOKUP(D31,'Contenido RETSIT esp'!$A$3:$B$24,2,FALSE),IF(B31=\"ANEXO2\",VLOOKUP(D31,'Contenido RETSIT esp'!$A$26:$B$98,2,FALSE),IF(B31=\"ANEXO3\",VLOOKUP(D31,'Contenido RETSIT esp'!$A$100:$B$105,2,FALSE),IF(B31=\"ANEXO4\",VLOOKUP(D31,'Contenido RETSIT esp'!#REF!,2,FALSE),IF(B31=\"RESOLUCIÓN\",VLOOKUP(D31,'Contenido RETSIT esp'!$A$107:$B$114,2,FALSE),IF(B31=\"MEMORIAJUSTIFICATIVA\",VLOOKUP(D31,'Contenido RETSIT esp'!$A$114:$B$145,2,FALSE),\"\")))))),\"\")","v":""}]
[null,null,{"$f":"IFERROR(VLOOKUP(B32,'Contenido RETSIT esp'!$A$2:$B$145,2,FALSE),\"\")","v":""},null,{"$f":"+_xlfn.IFNA(+IF(B32=\"ANEXO1\",VLOOKUP(D32,'Contenido RETSIT esp'!$A$3:$B$24,2,FALSE),IF(B32=\"ANEXO2\",VLOOKUP(D32,'Contenido RETSIT esp'!$A$26:$B$98,2,FALSE),IF(B32=\"ANEXO3\",VLOOKUP(D32,'Contenido RETSIT esp'!$A$100:$B$105,2,FALSE),IF(B32=\"ANEXO4\",VLOOKUP(D32,'Contenido RETSIT esp'!#REF!,2,FALSE),IF(B32=\"RESOLUCIÓN\",VLOOKUP(D32,'Contenido RETSIT esp'!$A$107:$B$114,2,FALSE),IF(B32=\"MEMORIAJUSTIFICATIVA\",VLOOKUP(D32,'Contenido RETSIT esp'!$A$114:$B$145,2,FALSE),\"\")))))),\"\")","v":""}]
[null,null,{"$f":"IFERROR(VLOOKUP(B33,'Contenido RETSIT esp'!$A$2:$B$145,2,FALSE),\"\")","v":""},null,{"$f":"+_xlfn.IFNA(+IF(B33=\"ANEXO1\",VLOOKUP(D33,'Contenido RETSIT esp'!$A$3:$B$24,2,FALSE),IF(B33=\"ANEXO2\",VLOOKUP(D33,'Contenido RETSIT esp'!$A$26:$B$98,2,FALSE),IF(B33=\"ANEXO3\",VLOOKUP(D33,'Contenido RETSIT esp'!$A$100:$B$105,2,FALSE),IF(B33=\"ANEXO4\",VLOOKUP(D33,'Contenido RETSIT esp'!#REF!,2,FALSE),IF(B33=\"RESOLUCIÓN\",VLOOKUP(D33,'Contenido RETSIT esp'!$A$107:$B$114,2,FALSE),IF(B33=\"MEMORIAJUSTIFICATIVA\",VLOOKUP(D33,'Contenido RETSIT esp'!$A$114:$B$145,2,FALSE),\"\")))))),\"\")","v":""}]
[null,null,{"$f":"IFERROR(VLOOKUP(B34,'Contenido RETSIT esp'!$A$2:$B$145,2,FALSE),\"\")","v":""},null,{"$f":"+_xlfn.IFNA(+IF(B34=\"ANEXO1\",VLOOKUP(D34,'Contenido RETSIT esp'!$A$3:$B$24,2,FALSE),IF(B34=\"ANEXO2\",VLOOKUP(D34,'Contenido RETSIT esp'!$A$26:$B$98,2,FALSE),IF(B34=\"ANEXO3\",VLOOKUP(D34,'Contenido RETSIT esp'!$A$100:$B$105,2,FALSE),IF(B34=\"ANEXO4\",VLOOKUP(D34,'Contenido RETSIT esp'!#REF!,2,FALSE),IF(B34=\"RESOLUCIÓN\",VLOOKUP(D34,'Contenido RETSIT esp'!$A$107:$B$114,2,FALSE),IF(B34=\"MEMORIAJUSTIFICATIVA\",VLOOKUP(D34,'Contenido RETSIT esp'!$A$114:$B$145,2,FALSE),\"\")))))),\"\")","v":""}]
[null,null,{"$f":"IFERROR(VLOOKUP(B35,'Contenido RETSIT esp'!$A$2:$B$145,2,FALSE),\"\")","v":""},null,{"$f":"+_xlfn.IFNA(+IF(B35=\"ANEXO1\",VLOOKUP(D35,'Contenido RETSIT esp'!$A$3:$B$24,2,FALSE),IF(B35=\"ANEXO2\",VLOOKUP(D35,'Contenido RETSIT esp'!$A$26:$B$98,2,FALSE),IF(B35=\"ANEXO3\",VLOOKUP(D35,'Contenido RETSIT esp'!$A$100:$B$105,2,FALSE),IF(B35=\"ANEXO4\",VLOOKUP(D35,'Contenido RETSIT esp'!#REF!,2,FALSE),IF(B35=\"RESOLUCIÓN\",VLOOKUP(D35,'Contenido RETSIT esp'!$A$107:$B$114,2,FALSE),IF(B35=\"MEMORIAJUSTIFICATIVA\",VLOOKUP(D35,'Contenido RETSIT esp'!$A$114:$B$145,2,FALSE),\"\")))))),\"\")","v":""}]
[null,null,{"$f":"IFERROR(VLOOKUP(B36,'Contenido RETSIT esp'!$A$2:$B$145,2,FALSE),\"\")","v":""},null,{"$f":"+_xlfn.IFNA(+IF(B36=\"ANEXO1\",VLOOKUP(D36,'Contenido RETSIT esp'!$A$3:$B$24,2,FALSE),IF(B36=\"ANEXO2\",VLOOKUP(D36,'Contenido RETSIT esp'!$A$26:$B$98,2,FALSE),IF(B36=\"ANEXO3\",VLOOKUP(D36,'Contenido RETSIT esp'!$A$100:$B$105,2,FALSE),IF(B36=\"ANEXO4\",VLOOKUP(D36,'Contenido RETSIT esp'!#REF!,2,FALSE),IF(B36=\"RESOLUCIÓN\",VLOOKUP(D36,'Contenido RETSIT esp'!$A$107:$B$114,2,FALSE),IF(B36=\"MEMORIAJUSTIFICATIVA\",VLOOKUP(D36,'Contenido RETSIT esp'!$A$114:$B$145,2,FALSE),\"\")))))),\"\")","v":""}]
[null,null,{"$f":"IFERROR(VLOOKUP(B37,'Contenido RETSIT esp'!$A$2:$B$145,2,FALSE),\"\")","v":""},null,{"$f":"+_xlfn.IFNA(+IF(B37=\"ANEXO1\",VLOOKUP(D37,'Contenido RETSIT esp'!$A$3:$B$24,2,FALSE),IF(B37=\"ANEXO2\",VLOOKUP(D37,'Contenido RETSIT esp'!$A$26:$B$98,2,FALSE),IF(B37=\"ANEXO3\",VLOOKUP(D37,'Contenido RETSIT esp'!$A$100:$B$105,2,FALSE),IF(B37=\"ANEXO4\",VLOOKUP(D37,'Contenido RETSIT esp'!#REF!,2,FALSE),IF(B37=\"RESOLUCIÓN\",VLOOKUP(D37,'Contenido RETSIT esp'!$A$107:$B$114,2,FALSE),IF(B37=\"MEMORIAJUSTIFICATIVA\",VLOOKUP(D37,'Contenido RETSIT esp'!$A$114:$B$145,2,FALSE),\"\")))))),\"\")","v":""}]
[null,null,{"$f":"IFERROR(VLOOKUP(B38,'Contenido RETSIT esp'!$A$2:$B$145,2,FALSE),\"\")","v":""},null,{"$f":"+_xlfn.IFNA(+IF(B38=\"ANEXO1\",VLOOKUP(D38,'Contenido RETSIT esp'!$A$3:$B$24,2,FALSE),IF(B38=\"ANEXO2\",VLOOKUP(D38,'Contenido RETSIT esp'!$A$26:$B$98,2,FALSE),IF(B38=\"ANEXO3\",VLOOKUP(D38,'Contenido RETSIT esp'!$A$100:$B$105,2,FALSE),IF(B38=\"ANEXO4\",VLOOKUP(D38,'Contenido RETSIT esp'!#REF!,2,FALSE),IF(B38=\"RESOLUCIÓN\",VLOOKUP(D38,'Contenido RETSIT esp'!$A$107:$B$114,2,FALSE),IF(B38=\"MEMORIAJUSTIFICATIVA\",VLOOKUP(D38,'Contenido RETSIT esp'!$A$114:$B$145,2,FALSE),\"\")))))),\"\")","v":""}]
[null,null,{"$f":"IFERROR(VLOOKUP(B39,'Contenido RETSIT esp'!$A$2:$B$145,2,FALSE),\"\")","v":""},null,{"$f":"+_xlfn.IFNA(+IF(B39=\"ANEXO1\",VLOOKUP(D39,'Contenido RETSIT esp'!$A$3:$B$24,2,FALSE),IF(B39=\"ANEXO2\",VLOOKUP(D39,'Contenido RETSIT esp'!$A$26:$B$98,2,FALSE),IF(B39=\"ANEXO3\",VLOOKUP(D39,'Contenido RETSIT esp'!$A$100:$B$105,2,FALSE),IF(B39=\"ANEXO4\",VLOOKUP(D39,'Contenido RETSIT esp'!#REF!,2,FALSE),IF(B39=\"RESOLUCIÓN\",VLOOKUP(D39,'Contenido RETSIT esp'!$A$107:$B$114,2,FALSE),IF(B39=\"MEMORIAJUSTIFICATIVA\",VLOOKUP(D39,'Contenido RETSIT esp'!$A$114:$B$145,2,FALSE),\"\")))))),\"\")","v":""}]
[null,null,{"$f":"IFERROR(VLOOKUP(B40,'Contenido RETSIT esp'!$A$2:$B$145,2,FALSE),\"\")","v":""},null,{"$f":"+_xlfn.IFNA(+IF(B40=\"ANEXO1\",VLOOKUP(D40,'Contenido RETSIT esp'!$A$3:$B$24,2,FALSE),IF(B40=\"ANEXO2\",VLOOKUP(D40,'Contenido RETSIT esp'!$A$26:$B$98,2,FALSE),IF(B40=\"ANEXO3\",VLOOKUP(D40,'Contenido RETSIT esp'!$A$100:$B$105,2,FALSE),IF(B40=\"ANEXO4\",VLOOKUP(D40,'Contenido RETSIT esp'!#REF!,2,FALSE),IF(B40=\"RESOLUCIÓN\",VLOOKUP(D40,'Contenido RETSIT esp'!$A$107:$B$114,2,FALSE),IF(B40=\"MEMORIAJUSTIFICATIVA\",VLOOKUP(D40,'Contenido RETSIT esp'!$A$114:$B$145,2,FALSE),\"\")))))),\"\")","v":""}]
{"$rows_left_out":62}
{"sheet":"Contenido RETSIT gral","index":1,"n_rows":36,"n_cols":5,"rows_kept":36,"cut":false,"hidden":true,"merged":[]}
["Contenido RETSIT general"]
["ANEXO1","RESOLUCIÓN","MEMORIAJUSTIFICATIVA",null,"TIPO DE COMENTARIO"]
["TÍTULO 1. ","CONSIDERANDOS",1,null,"Editorial"]
["ARTÍCULO 1.1","RESUELVE","1.1",null,"Técnico"]
["ARTÍCULO 1.2 ","ARTÍCULO 1","1.1.1"]
["ARTÍCULO 1.3 ","ARTÍCULO 2","1.1.2"]
["ARTÍCULO 1.4 ","ARTÍCULO 3","1.1.3"]
["ARTÍCULO 1.5 ",1,"1.1.4"]
["ARTÍCULO 1.6 ",2,"1.2"]
["TÍTULO 2. ","ARTÍCULO 4","1.3"]
["ARTÍCULO 2.1 ",null,"1.3.1"]
["ARTÍCULO 2.2",null,"1.3.2"]
["ARTÍCULO 2.3 ",null,"1.3.3"]
["ARTÍCULO 2.4 ",null,"1.3.4"]
["ARTÍCULO 2.5 ",null,2]
["ARTÍCULO 2.6 ",null,3]
["TÍTULO 3.",null,"3.1"]
["ARTÍCULO 3.1 ",null,"a"]
["ARTÍCULO 3.2 ",null,"b"]
["ARTÍCULO 3.3 ",null,"c"]
["ARTÍCULO 3.4 ",null,"d"]
["ARTÍCULO 3.5",null,"e"]
["ARTÍCULO 3.6",null,"f"]
["TÍTULO 4. ",null,"g"]
["ARTÍCULO 4.1 ",null,"3.2"]
["ARTÍCULO 4.2 ",null,"3.3"]
["ARTÍCULO 4.3 ",null,"3.4"]
["TÍTULO 5. ",null,"3.5"]
["ARTÍCULO 5.1 ",null,4]
["ARTÍCULO 5.2 ",null,5]
["ARTÍCULO 5.3 ",null,6]
[null,null,7]
[null,null,"4.4"]
[null,null,"4.5"]
[null,null,5]
[null,null,6]

{"sheet":"Contenido RETSIT esp","index":2,"n_rows":145,"n_cols":2,"rows_kept":145,"cut":false,"hidden":true,"merged":[[0,0,0,1]]}
["Contenido RETSIT especifico"]
["ANEXO1","DISPOSICIONES GENERALES"]
["TÍTULO 1. ","DISPOSICIONES GENERALES"]
["ARTÍCULO 1.1","OBJETO"]
["ARTÍCULO 1.2 ","CAMPO DE APLICACIÓN"]
["1.2.1. ","INSTALACIONES"]
["1.2.2. ","PERSONAS"]
["1.2.2.1 ","Responsabilidades del diseñador"]
["1.2.2.2 ","Responsabilidad en la construcción y montaje"]
["1.2.2.3 ","Responsabilidad en la operación y mantenimiento de la instalación"]
["1.2.3. ","EXCEPCIONES EN INSTALACIONES"]
["ARTÍCULO 1.3 ","DEFINICIONES"]
["ARTÍCULO 1.4 ","ACRÓNIMOS Y SIGLAS"]
["ARTÍCULO 1.5 ","SISTEMA DE UNIDADES"]
["1.5.1. ","Unidades del SI"]
["1.5.2. ","Unidades del sistema inglés"]
["1.5.3. ","Unidades del sistema técnico"]
["1.5.4. ","Conversión de unidades"]
["ARTÍCULO 1.6 ","SIMBOLOGÍA Y SEÑALIZACIÓN"]
["TÍTULO 2. ","REQUISITOS DE LAS INSTALACIONES TÉRMICAS"]
["ARTÍCULO 2.1 ","DISEÑO Y MONTAJE"]
["2.1.1. ","Diseño de sistemas térmicos de acondicionamiento de aire"]
["2.1.2. ","Diseño de sistemas térmicos de refrigeración"]
["2.1.3. ","Distribución de aire"]
["2.1.4. ","PRESIÓN MÁXIMA PERMISIBLE"]
["2.1.4.1 ","Métodos para determinar la PS"]
["2.1.4.2 ","Relaciones de presión con la PS"]
["2.1.5.","MONTAJE DE UNIONES, CONECTORES Y TUBERÍAS"]
["2.1.5.1","Estructuras de soporte y bases para las instalaciones térmicas"]
["2.1.5.2 ","Selección de uniones y conectores"]
["2.1.5.3 ","Configuración y disposición"]
["2.1.5.4 ","Protección de tuberías, uniones y conectores"]
["2.1.5.5 ","Exposición a peligros"]
["2.1.5.6 ","Recintos ventilados"]
["2.1.5.7 ","Tuberías para accesorios y medidas"]
["2.1.5.8 ","Dispositivos de seguridad"]
["ARTÍCULO 2.2","PRUEBAS PUESTA A PUNTO"]
["2.2.1. ","PRUEBA DE RESISTENCIA A LA PRESIÓN"]
["2.2.2. ","PRUEBA DE HERMETICIDAD"]
["2.2.2.1 ","Prueba de hermeticidad de Sistemas autónomos con carga de refrigerante menor a 5 kg (11 lb)"]
{"$rows_left_out":106}
{"sheet":"Hoja1","index":3,"n_rows":40,"n_cols":1,"rows_kept":40,"cut":false,"hidden":true,"merged":[]}
["Por la cual se expide el nuevo Reglamento Técnico de Instalaciones Eléctricas - RETIE "]
["CONSIDERANDOS"]
["RESUELVE"]
["OBJETO"]
["ÁMBITO DE APLICACIÓN"]
["DISPOSICIONES TRANSITORIAS"]
["TRANSITORIEDAD INSTALACIONES"]
["TRANSITORIEDAD PERSONAS"]
["VIGENCIA Y DEROGATORIAS"]
["MEMORIA JUSTIFICATIVA"]
["ANTECEDENTES Y RAZONES DE OPORTUNIDAD Y CONVENIENCIA QUE JUSTIFICAN SU EXPEDICIÓN."]
["ANTECEDENTES"]
["Análisis de impacto normativo"]
["Elaboración documento anteproyecto"]
["Etapa de buenas prácticas Reglamentarias"]
["Consulta pública nacional"]
["RAZONES DE OPORTUNIDAD"]
["CONVENIENCIA"]
["Respecto del Anexo 1 - Generalidades"]
["Respecto del Anexo 2 - Productos"]
["Respecto del Anexo 3 - Instalaciones"]
["Respecto del Anexo 4 - Demostración de la conformidad"]
["ÁMBITO DE APLICACIÓN Y SUJETOS A QUIENES VA DIRIGIDO"]
["VIABILIDAD JURÍDICA"]
["Análisis de las normas que otorgan la competencia para la expedición del proyecto normativo"]
["Artículo 78 de Constitución Política de Colombia:"]
["Artículo 189 de Constitución Política de Colombia"]
["Artículo 59 de la Ley 489 de 1998"]
["Artículo 61 de la Ley 489 de 1998"]
["Numeral 9 del artículo 2° del Decreto 381 de 2012"]
["Numeral 7 del artículo 5° del Decreto 381 de 2012, modificado por el artículo 5 del Decreto 030 de 2022"]
["Numeral 3 del artículo 16° del Decreto 381 de 2012"]
["Vigencia de la ley o norma reglamentada o desarrollada"]
["Disposiciones derogas, subrogadas, modificadas, adicionadas o sustituidas "]
["Revisión y análisis de la jurisprudencia que tenga impacto o sea relevante para la expedición del proyecto normativo (órganos de cierre de cada jurisdicción)"]
["Circunstancias jurídicas adicionales "]
["IMPACTO ECONÓMICO"]
["VIABILIDAD O DISPONIBILIDAD PRESUPUESTAL"]
["IMPACTO MEDIOAMBIENTAL O SOBRE EL PATRIMONIO CULTURAL DE LA NACIÓN"]
["ESTUDIOS TÉCNICOS QUE SUSTENTEN EL PROYECTO NORMATIVO (Si cuenta con ellos) "]