{"text_format":"1","workbook":"xlsx","n_sheets":11,"sheets":["INICIO","Instructivo","Matriz Riesgos de Gestión","Matriz Riesgos de corrupción","Matriz Riesgos de SPI","Opciones Tratamiento (Listas)","Tabla probabilidad","Tabla Impacto","Hoja3","Tabla Valoración controles","Hoja1"],"not_rendered":{"charts":0,"images":7,"macros":1,"external_links":10,"defined_names":101,"comments":4,"pivot_tables":1},"unopened":[],"bounds":{"document_bytes":16777216,"sheet_cells":100000,"rows_first":2000,"rows_last":500,"rows_between":2000,"halvings":0,"cell_chars":16384,"cell_head_chars":4096},"cells_cut":0,"cells_raw":0,"read":"whole","date_system":"1900"}

{"sheet":"INICIO","index":0,"n_rows":0,"n_cols":0,"rows_kept":0,"cut":false,"hidden":true,"merged":[]}

{"sheet":"Instructivo","index":1,"n_rows":45,"n_cols":5,"rows_kept":45,"cut":false,"hidden":true,"merged":[[14,2,14,3],[14,4,14,5],[21,4,21,5],[21,2,21,3],[24,2,24,3],[24,4,24,5],[27,4,27,5],[27,2,27,3],[32,2,32,3],[40,1,40,7],[28,2,28,3],[28,4,28,5],[29,2,29,3],[29,4,29,5],[32,4,32,5],[33,2,33,3],[34,2,34,3],[34,4,34,5],[35,4,35,5],[36,4,36,5],[36,2,36,3],[42,1,42,7],[41,1,41,7],[37,2,37,3],[37,4,37,5],[39,1,39,7],[43,1,43,7],[44,1,44,7],[22,4,22,5],[22,2,22,3],[23,2,23,3],[23,4,23,5],[25,2,25,3],[25,4,25,5],[33,4,33,5],[31,2,31,3],[30,2,30,3],[30,4,30,5],[31,4,31,5],[26,2,26,3],[26,4,26,5],[35,2,35,3],[12,2,12,3],[12,4,12,5],[16,2,16,3],[16,4,16,5],[20,2,20,3],[17,2,17,3],[18,2,18,3],[19,2,19,3],[17,4,17,5],[18,4,18,5],[19,4,19,5],[20,4,20,5],[15,2,15,3],[15,4,15,5],[13,2,13,3],[13,4,13,5],[1,1,1,7],[3,1,4,7],[5,1,5,7],[8,1,9,7],[11,2,11,3],[11,4,11,5],[6,1,6,7]]}
[]
[null,"Matriz Mapa de Riesgos"]
[]
[null,"Teniendo en cuenta que con la expedición del Decreto 1499 de 2017 “Por medio del cual se modifica el Decreto 1083 de 2015, Decreto Único Reglamentario del Sector Función Pública, en lo relacionado con el Sistema de Gestión establecido en el artículo 133 de la Ley 1753 de 2015”, se crea un solo Sistema de Gestión y se alinea con el Sistema de Control Interno, hoy todas las entidades públicas requieren actualizar y/o implementar el Modelo Integrado de Planeación y Gestión MIPG, modelo que incorpora el Modelo Estándar de Control Interno MECI a través de la 7a dimensión del mismo.  En este marco general, el proceso de administración del riesgo es un esfuerzo conjunto entre la Alta Dirección y los servidores en todos sus niveles, ejercicio que inicia con la formulación de la política de Administración del Riesgo, la cual incluye los niveles de responsabilidad frente al seguimiento y evaluación, aspectos que deberán definirse acorde con el Esquema de Líneas de Defensa vinculado a la Dimensión 7.\n\nTeniendo en cuenta lo anterior y dada la necesidad de las entidades frente a la estructuración de los mapas de riesgos, como herramienta fundamental frente a la gestión del riesgo, el presente formato desarrolla un esquema completo acorde con los contenidos metodológicos de la Guía para la Administración del Riesgo y el diseño de controles V5. El formato cuenta con celdas parametrizadas y permite contar con los respectivos mapas de calor para riesgo inherente y riesgo residual."]
[]
[null,"Orientaciones Generales"]
[null,"Antes de iniciar con el diligenciamiento de la información en la matriz, se requiere haber avanzado en el análisis del proceso, su objetivo, alcance, actividades clave, considere los lineamientos establecidos en el Paso 2: identificación del riesgo, donde se explica ampliamente las bases para adelanter este análisis.\nAsí mismo, considere en el Paso 3: valoración del riesgo los lineamientos para definir el No. de veces que se hace la actividad con la cual se relaciona el riesgo y su impacto en términos económicos o reputacionales. En este mismo paso se analizan los controles que deben responder a los atributos de eficiencia e informativos.\nNOTA: Si lo considera pertinente, es posible agregar hojas de trabajo adicionales al presente formato que permitan incluir la traza de estos análisis."]
[]
{"$rows_left_out":38}
{"sheet":"Matriz Riesgos de Gestión","index":2,"n_rows":67,"n_cols":56,"rows_kept":67,"cut":false,"hidden":false,"merged":[[1,0,3,4],[1,5,1,6],[2,5,2,6],[5,28,5,34],[5,39,5,43],[5,35,5,38],[4,2,4,43],[5,0,5,8],[5,9,5,15],[4,0,4,1],[5,22,5,27],[5,16,5,21]]}
[]
["FORMATO PARA LA FORMULACIÓN Y TRATAMIENTOS DE RIESGOS"]
[null,null,null,null,null,"E-ME-F-08"]
[null,null,null,null,null,"2023-12-29","V-4"]
["Proceso:",null,"TODOS LOS PROCESOS"]
["Identificación del riesgo",null,null,null,null,null,null,null,null,"Análisis del riesgo inherente",null,null,null,null,null,null,"Evaluación del riesgo - Valoración de los controles",null,null,null,null,null,"Atributos",null,null,null,null,null,"Evaluación del riesgo - Nivel del riesgo residual",null,null,null,null,null,null,"Plan de acción",null,null,null,"Responsable de Tratamiento"]
["Referencia ","Proceso","Tipo de Riesgo","Descripción del Riesgo ","Impacto","Causa o circunstancia Inmediata ¿Cómo?","Causa Raíz ¿Por a que?","Clasificación del Riesgo","Frecuencia con la cual se realiza la actividad anual","Probabilidad Inherente","%","Impacto","Observación de criterio","Impacto \nInherente","%","Zona de Riesgo Inherente","No. Control","Descripción del Control","Cargo del responsable del control ","Acción que realiza","Evidencia esperada del control","Afectación","Tipo","Implementación","Calificación","Documentación","Frecuencia","Evidencia","Probabilidad Residual","Probabilidad Residual Final","%","Impacto Residual Final","%","Zona de Riesgo Final","Tratamiento","Acción a realizar","Cargo del Responsable","Fecha de implementación","Fecha de seguimiento","Cargo del responsable","Área del Responsable","Jefe del Área del Responsable","Fecha Implementación\n(Inicio)","Fecha de Implementación\n(Fin)","Reporte primer Trimestre","¿se materializó?\nSi/No","Seguimiento segunda línea de defensa","Reporte segundo Trimestre","¿se materializó?\nSi/No","Seguimiento segunda línea de defensa","Reporte tercer Trimestre","¿se materializó?\nSi/No","Seguimiento segunda línea de defensa","Reporte cuarto Trimestre","¿se materializó?\nSi/No","Seguimiento segunda línea de defensa"]
[1,"DIRECCIONAMIENTO ESTRATÉGICO","Gestión",{"$f":"IF(C8=\"Fiscal\",_xlfn.CONCAT(\"Posibilidad de efectos dañosos sobre bienes públicos \",\" por o para \",F8,\" debido a \",G8),IF(C8=\"Gestión\",_xlfn.CONCAT(\"Posibilidad de afectacion \",E8,\" por \",F8,\" debido a \",G8),\"\"))","v":"Posibilidad de afectacion económico y reputacional por demandas y quejas de los interesados en la gestión de los trámites  debido a incumplimiento normativo relacionado con los trámites y servicios del Ministerio."},"económico y reputacional","demandas y quejas de los interesados en la gestión de los trámites ","incumplimiento normativo relacionado con los trámites y servicios del Ministerio.","Usuarios, productos y practicas , organizacionales",40,{"$f":"IF(I8<=0,\"\",IF(I8<=2,\"Muy Baja\",IF(I8<=5,\"Baja\",IF(I8<=19,\"Media\",IF(I8<=50,\"Alta\",\"Muy Alta\")))))","v":"Alta"},{"$f":"IF(J8=\"\",\"\",IF(J8=\"Muy Baja\",0.2,IF(J8=\"Baja\",0.4,IF(J8=\"Media\",0.6,IF(J8=\"Alta\",0.8,IF(J8=\"Muy Alta\",1,))))))","v":0.8},"     Mayor a 500 SMLMV ",{"$f":"IF(NOT(ISERROR(MATCH(L8,'Tabla Impacto'!$B$221:$B$223,0))),'Tabla Impacto'!$F$223&\"Por favor no seleccionar los criterios de impacto(Afectación Económica o presupuestal y Pérdida Reputacional)\",L8)","v":"     Mayor a 500 SMLMV "},{"$f":"IF(OR(M8='Tabla Impacto'!$C$11,M8='Tabla Impacto'!$D$11),\"Leve\",IF(OR(M8='Tabla Impacto'!$C$12,M8='Tabla Impacto'!$D$12),\"Menor\",IF(OR(M8='Tabla Impacto'!$C$13,M8='Tabla Impacto'!$D$13),\"Moderado\",IF(OR(M8='Tabla Impacto'!$C$14,M8='Tabla Impacto'!$D$14),\"Mayor\",IF(OR(M8='Tabla Impacto'!$C$15,M8='Tabla Impacto'!$D$15),\"Catastrófico\",\"\")))))","v":"Catastrófico"},{"$f":"IF(N8=\"\",\"\",IF(N8=\"Leve\",0.2,IF(N8=\"Menor\",0.4,IF(N8=\"Moderado\",0.6,IF(N8=\"Mayor\",0.8,IF(N8=\"Catastrófico\",1,))))))","v":1},{"$f":"IF(OR(AND(J8=\"Muy Baja\",N8=\"Leve\"),AND(J8=\"Muy Baja\",N8=\"Menor\"),AND(J8=\"Baja\",N8=\"Leve\")),\"Bajo\",IF(OR(AND(J8=\"Muy baja\",N8=\"Moderado\"),AND(J8=\"Baja\",N8=\"Menor\"),AND(J8=\"Baja\",N8=\"Moderado\"),AND(J8=\"Media\",N8=\"Leve\"),AND(J8=\"Media\",N8=\"Menor\"),AND(J8=\"Media\",N8=\"Moderado\"),AND(J8=\"Alta\",N8=\"Leve\"),AND(J8=\"Alta\",N8=\"Menor\")),\"Moderado\",IF(OR(AND(J8=\"Muy Baja\",N8=\"Mayor\"),AND(J8=\"Baja\",N8=\"Mayor\"),AND(J8=\"Media\",N8=\"Mayor\"),AND(J8=\"Alta\",N8=\"Moderado\"),AND(J8=\"Alta\",N8=\"Mayor\"),AND(J8=\"Muy Alta\",N8=\"Leve\"),AND(J8=\"Muy Alta\",N8=\"Menor\"),AND(J8=\"Muy Alta\",N8=\"Moderado\"),AND(J8=\"Muy Alta\",N8=\"Mayor\")),\"Alto\",IF(OR(AND(J8=\"Muy Baja\",N8=\"Catastrófico\"),AND(J8=\"Baja\",N8=\"Catastrófico\"),AND(J8=\"Media\",N8=\"Catastrófico\"),AND(J8=\"Alta\",N8=\"Catastrófico\"),AND(J8=\"Muy Alta\",N8=\"Catastrófico\")),\"Extremo\",\"\"))))","v":"Extremo"},1,"El  profesional de la Oficina de Planeación y Gestión Internacional, del Grupo de Gestión y Desempeño,  verifica que la información de los tramites publicados en el SUIT se encuentra actualizada y sea la correcta a través de una plantilla de validación de información de cada tramite y la revisa con los encargados misionales correspondientes. ","Profesional Grupo de Gestión y Desempeño que administra el SUIT"," Verifica que la información de los tramites publicados en el SUIT se encuentra actualizada y sea la correcta a través de una plantilla de validación de información de cada tramite y la revisa con los encargados misionales correspondientes","Plantilla de validación de información de cada tramite",{"$f":"IF(OR(W8=\"Preventivo\",W8=\"Detectivo\"),\"Probabilidad\",IF(W8=\"Correctivo\",\"Impacto\",\"\"))","v":"Probabilidad"},"Preventivo","Manual",{"$f":"IF(AND(W8=\"Preventivo\",X8=\"Automático\"),\"50%\",IF(AND(W8=\"Preventivo\",X8=\"Manual\"),\"40%\",IF(AND(W8=\"Detectivo\",X8=\"Automático\"),\"40%\",IF(AND(W8=\"Detectivo\",X8=\"Manual\"),\"30%\",IF(AND(W8=\"Correctivo\",X8=\"Automático\"),\"35%\",IF(AND(W8=\"Correctivo\",X8=\"Manual\"),\"25%\",\"\"))))))","v":"40%"},"Documentado","Continua","Con Registro",{"$f":"IFERROR(IF(V8=\"Probabilidad\",(K8-(+K8*Y8)),IF(V8=\"Impacto\",K8,\"\")),\"\")","v":0.48},{"$f":"IFERROR(IF(AC8=\"\",\"\",IF(AC8<=0.2,\"Muy Baja\",IF(AC8<=0.4,\"Baja\",IF(AC8<=0.6,\"Media\",IF(AC8<=0.8,\"Alta\",\"Muy Alta\"))))),\"\")","v":"Media"},{"$f":"+AC8","v":0.48},{"$f":"IFERROR(IF(AG8=\"\",\"\",IF(AG8<=0.2,\"Leve\",IF(AG8<=0.4,\"Menor\",IF(AG8<=0.6,\"Moderado\",IF(AG8<=0.8,\"Mayor\",\"Catastrófico\"))))),\"\")","v":"Catastrófico"},{"$f":"IFERROR(IF(V8=\"Impacto\",(O8-(+O8*Y8)),IF(V8=\"Probabilidad\",O8,\"\")),\"\")","v":1},{"$f":"IFERROR(IF(OR(AND(AD8=\"Muy Baja\",AF8=\"Leve\"),AND(AD8=\"Muy Baja\",AF8=\"Menor\"),AND(AD8=\"Baja\",AF8=\"Leve\")),\"Bajo\",IF(OR(AND(AD8=\"Muy baja\",AF8=\"Moderado\"),AND(AD8=\"Baja\",AF8=\"Menor\"),AND(AD8=\"Baja\",AF8=\"Moderado\"),AND(AD8=\"Media\",AF8=\"Leve\"),AND(AD8=\"Media\",AF8=\"Menor\"),AND(AD8=\"Media\",AF8=\"Moderado\"),AND(AD8=\"Alta\",AF8=\"Leve\"),AND(AD8=\"Alta\",AF8=\"Menor\")),\"Moderado\",IF(OR(AND(AD8=\"Muy Baja\",AF8=\"Mayor\"),AND(AD8=\"Baja\",AF8=\"Mayor\"),AND(AD8=\"Media\",AF8=\"Mayor\"),AND(AD8=\"Alta\",AF8=\"Moderado\"),AND(AD8=\"Alta\",AF8=\"Mayor\"),AND(AD8=\"Muy Alta\",AF8=\"Leve\"),AND(AD8=\"Muy Alta\",AF8=\"Menor\"),AND(AD8=\"Muy Alta\",AF8=\"Moderado\"),AND(AD8=\"Muy Alta\",AF8=\"Mayor\")),\"Alto\",IF(OR(AND(AD8=\"Muy Baja\",AF8=\"Catastrófico\"),AND(AD8=\"Baja\",AF8=\"Catastrófico\"),AND(AD8=\"Media\",AF8=\"Catastrófico\"),AND(AD8=\"Alta\",AF8=\"Catastrófico\"),AND(AD8=\"Muy Alta\",AF8=\"Catastrófico\")),\"Extremo\",\"\")))),\"\")","v":"Extremo"},"Evitar",null,null,null,null,"Profesional Grupo de Gestión y Desempeño que administra el SUIT","Grupo de Gestión y Desempeño","Jefe de la Oficina  de Planeación y Gestión Internacional","2024-02-01","2024-12-31"]
{"$rows_left_out":60}
{"sheet":"Matriz Riesgos de corrupción","index":3,"n_rows":25,"n_cols":99,"rows_kept":25,"cut":false,"hidden":false,"merged":[[1,0,3,3],[2,5,2,6],[1,5,1,6],[7,47,8,47],[7,45,8,45],[7,44,8,44],[7,0,8,0],[5,0,5,1],[7,29,8,29],[7,3,8,3],[5,2,5,42],[7,32,8,32],[6,32,6,43],[7,30,8,30],[7,28,8,28],[7,37,8,37],[7,1,8,1],[6,0,6,5],[6,6,6,31],[7,27,8,27],[6,44,6,50],[7,50,8,50],[7,8,7,26],[7,2,8,2],[7,7,8,7],[7,6,8,6],[7,5,8,5],[7,4,8,4],[7,31,8,31],[7,38,7,43],[7,51,7,54],[7,46,8,46],[7,48,8,48],[6,51,6,59],[7,55,7,59],[7,49,8,49]]}
[]
["FORMATO PARA LA FORMULACIÓN Y TRATAMIENTOS DE RIESGOS"]
[null,null,null,null,null,"E-ME-F-08"]
[null,null,null,null,null,"2023-12-29","V-4"]
[]
["Proceso:",null,"TODOS LOS PROCESOS"]
["Identificación del riesgo",null,null,null,null,null,"Análisis del riesgo inherente",null,null,null,null,null,null,null,null,null,null,null,null,null,null,null,null,null,null,null,null,null,null,null,null,null,"Evaluación del riesgo - Valoración de los controles",null,null,null,null,null,null,null,null,null,null,null,"Evaluación del riesgo - Nivel del riesgo residual",null,null,null,null,null,null,"Tratamiento del Riesgo"]
["Referencia ","Proceso","Descripción del Riesgo ","Causa Inmediata ¿Cómo se podria dar la corrupción?","Clasificación del Riesgo","Frecuencia con la cual se realiza la actividad anual","Probabilidad Inherente","%","Si el Riesgo se materializará podria…",null,null,null,null,null,null,null,null,null,null,null,null,null,null,null,null,null,null,"Suma Afirmaciones","Calificación Impacto","Impacto \nInherente","%","Zona de Riesgo Inherente","No. Control",null,null,null,null,"Afectación","Atributos",null,null,null,null,null,"Probabilidad Residual","Probabilidad Residual Final","%","Impacto Residual Final","%","Zona de Riesgo Final","Tratamiento","Plan de acción",null,null,null,"Responsable de Tratamiento"]
{"$rows_left_out":18}
{"sheet":"Matriz Riesgos de SPI","index":4,"n_rows":15,"n_cols":53,"rows_kept":15,"cut":false,"hidden":false,"merged":[[8,22,8,27],[1,0,3,3],[1,16,3,20],[1,21,1,25],[2,21,2,25],[3,21,3,25],[6,0,6,1],[6,3,6,40],[7,0,7,8],[7,9,7,15],[7,16,7,27],[7,28,7,34],[7,35,7,40],[1,5,1,6],[2,5,2,6]]}
[]
["FORMATO PARA LA FORMULACIÓN Y TRATAMIENTOS DE RIESGOS",null,null,null,null,null,null,null,null,null,null,null,null,null,null,null,"IDENTIFICACIÓN DE RIESGOS",null,null,null,null,"Código: XXXXXX"]
[null,null,null,null,null,"E-ME-F-08",null,null,null,null,null,null,null,null,null,null,null,null,null,null,null,"Versión: XX"]
[null,null,null,null,null,"2023-12-29","V-4",null,null,null,null,null,null,null,null,null,null,null,null,null,null,"Fecha de aprobación: XX-XX-XXXX"]
[]
[]
["Proceso:",null,"Todos los procesos"]
["Identificación del riesgo",null,null,null,null,null,null,null,null,"Análisis del riesgo inherente",null,null,null,null,null,null,"Evaluación del riesgo - Valoración de los controles",null,null,null,null,null,null,null,null,null,null,null,"Evaluación del riesgo - Nivel del riesgo residual",null,null,null,null,null,null,"Plan de Acción "]
{"$rows_left_out":8}
{"sheet":"Opciones Tratamiento (Listas)","index":5,"n_rows":22,"n_cols":13,"rows_kept":22,"cut":false,"hidden":true,"merged":[[14,12,14,15],[1,6,1,10],[2,3,2,4],[3,3,3,4],[4,3,4,4],[8,12,8,15],[5,3,5,4],[1,12,1,15],[2,12,2,15],[3,12,3,15]]}
[]
[null,"Tratamiento",null,null,null,null,"PROCESOS ",null,null,null,null,null,"Plan de accion (solo para la opción reducir)"]
[null,"Aceptar",null,"IMPACTO",null,null,"DIRECCIONAMIENTO ESTRATÉGICO",null,null,null,null,null,"Finalizado"]
[null,"Evitar",null,"económico",null,null,"MEJORAMIENTO",null,null,null,null,null,"En curso"]
[null,"Reducir (compartir)",null,"reputacional",null,null,"GESTIÓN TALENTO HUMANO"]
[null,"Reducir (mitigar)",null,"económico y reputacional",null,null,"GESTIÓN DE COMUNICACIONES"]
[null,null,null,null,null,null,"GESTIÓN TECNOLÓGICA"]
[null,null,null,null,null,null,"GESTIÓN JURÍDICA"]
{"$rows_left_out":15}
{"sheet":"Tabla probabilidad","index":6,"n_rows":8,"n_cols":4,"rows_kept":8,"cut":false,"hidden":true,"merged":[[0,1,0,3]]}
[null,"Tabla Criterios para definir el nivel de probabilidad"]
[]
[null,null,"Frecuencia de la Actividad","Probabilidad"]
[null,"Muy Baja","La actividad que conlleva el riesgo se ejecuta como máximos 2 veces por año",0.2]
[null,"Baja","La actividad que conlleva el riesgo se ejecuta de 3 a 5 veces por año",0.4]
[null,"Media","La actividad que conlleva el riesgo se ejecuta de 6 a 19 veces por año",0.6]
[null,"Alta","La actividad que conlleva el riesgo se ejecuta mínimo 20 veces al año y máximo 50 veces por año",0.8]
[null,"Muy Alta","La actividad que conlleva el riesgo se ejecuta más de 50 veces por año",1]
{"$rows_left_out":1}
{"sheet":"Tabla Impacto","index":7,"n_rows":224,"n_cols":8,"rows_kept":224,"cut":false,"hidden":true,"merged":[[0,1,0,3]]}
[null,"Tabla Criterios para definir el nivel de impacto"]
[]
[null,null,"Afectación Económica (o presupuestal)","Pérdida Reputacional"]
["Insignificante","Leve 20%","Afectación menor a 10 SMLMV","No se afecta la imagen institucional de alguna área de forma significativa."]
["Menor","Menor-40% ","Entre 10 y 50 SMLMV","Afecta la imagen de la entidad internamente, de conocimiento general, nivel interno, de junta directiva y accionistas y/o de proveedores. \n\nImagen institucional afectada localmente por retrasos en la prestación del servicio a los usuarios o ciudadanos.\n"]
["Moderado","Moderado 60%","Entre 50 y 100 SMLMV","Afecta la imagen de la entidad con algunos usuarios de relevancia frente al logro de los objetivos. \n\nImagen institucional afectada en el orden nacional o regional por retrasos en la prestación del servicio a los usuarios o ciudadanos.\n"]
["Mayor","Mayor 80%","Entre 100 y 500 SMLMV","Afecta la imagen de la entidad con efecto publicitario sostenido a nivel de sector administrativo, departamental o municipal. \n\nImagen institucional afectada en el orden nacional o regional por incumplimientos en la prestación del servicio a los usuarios o ciudadanos\n"]
["Catastrófico","Catastrófico 100%","Mayor a 500 SMLMV","Afecta la imagen de la entidad a nivel nacional, con efecto publicitario sostenible a nivel país. \n\nImagen institucional afectada en el orden nacional o regional por actos o hechos de corrupción comprobados.\n"]
{"$rows_left_out":217}
{"sheet":"Hoja3","index":8,"n_rows":0,"n_cols":0,"rows_kept":0,"cut":false,"hidden":true,"merged":[]}

{"sheet":"Tabla Valoración controles","index":9,"n_rows":15,"n_cols":6,"rows_kept":15,"cut":false,"hidden":true,"merged":[[0,1,0,5],[14,1,14,5],[2,1,2,3],[3,1,7,1],[3,2,5,2],[6,2,7,2],[8,1,13,1],[8,2,9,2],[10,2,11,2],[12,2,13,2]]}
[null,"Tabla Atributos de para el diseño del control"]
[]
[null,"Características",null,null,"Descripción","Peso"]
[null,"Atributos de Eficiencia","Tipo","Preventivo","Va hacia las causas del riesgo, aseguran el resultado final esperado.",0.25]
[null,null,null,"Detectivo","Detecta que algo ocurre y devuelve el proceso a los controles preventivos.\nSe pueden generar reprocesos.",0.15]
[null,null,null,"Correctivo","Dado que permiten reducir el impacto de la materialización del riesgo, tienen un costo en su implementación.",0.1]
[null,null,"Implementación","Automático","Son actividades de procesamiento o validación de información que se ejecutan por un sistema y/o aplicativo de manera automática sin la intervención de personas para su realización.",0.25]
[null,null,null,"Manual","Controles que son ejecutados por una persona., tiene implícito el error humano.",0.15]
{"$rows_left_out":8}
{"sheet":"Hoja1","index":10,"n_rows":21,"n_cols":1,"rows_kept":21,"cut":false,"hidden":true,"merged":[]}
[]
[]
["Preventivo"]
["Detectivo"]
["Correctivo"]
["Automático"]
["Manual"]
["Documentado"]
{"$rows_left_out":13}