{"text_format":"1","workbook":"xlsx","n_sheets":4,"sheets":["Hoja1","Dato_Empresas","DANE","Mcpio"],"not_rendered":{"charts":0,"images":0,"macros":1,"external_links":0,"defined_names":8,"comments":1,"pivot_tables":0},"unopened":[],"bounds":{"document_bytes":16777216,"sheet_cells":100000,"rows_first":2000,"rows_last":500,"rows_between":2000,"halvings":0,"cell_chars":16384,"cell_head_chars":4096},"cells_cut":0,"cells_raw":0,"read":"whole","date_system":"1900"}

{"sheet":"Hoja1","index":0,"n_rows":153,"n_cols":22,"rows_kept":153,"cut":false,"hidden":false,"merged":[[1,1,1,21],[2,1,2,21],[9,3,10,3],[9,16,10,16],[9,17,10,17],[9,9,10,9],[9,8,10,8],[9,4,10,4],[9,10,9,15],[9,21,10,21],[9,18,10,18],[4,0,4,1],[5,0,5,1],[9,1,10,1],[6,0,6,1],[3,6,3,8],[152,1,153,17],[9,20,10,20],[9,19,10,19],[9,7,10,7],[4,2,4,3],[4,6,4,8],[6,2,6,3],[6,6,6,8],[5,2,5,3],[9,5,10,5],[9,6,10,6],[9,2,10,2]]}
[]
[null,"Formato Reporte Información de Coberturas \nServicio Público Domiciliario de Distribución de Gas Combustible por Red"]
[null,"Ministerio de Minas y Energía - Dirección de Hidrocarburos"]
[null,null,null,null,null,"COD FSSRI",{"$f":"+IF(C5=\"\",\"\",VLOOKUP(C5,Dato_Empresas!A1:F78,6,0))","v":1324}]
["Empresa",null,"ALCANOS DE COLOMBIA S.A. E.S.P. ",null,null,"NIT",{"$f":"+IF(C5=\"\",\"\",VLOOKUP(C5,Dato_Empresas!A1:F78,2,0))","v":"891101577-4"},null,null,null,null,null,"Fecha de corte reporte información","2026-06-30"]
[]
["Responsable",null,{"$f":"+IF(C5=\"\",\"\",VLOOKUP(C5,Dato_Empresas!A1:E78,4,0))","v":"CAMILO ERNESTO LOZANO HERMIDA"},null,null,"Cargo",{"$f":"+IF(C5=\"\",\"\",VLOOKUP(C5,Dato_Empresas!A1:E78,5,0))","v":"Gerente General"}]
[]
[]
[null,"Mercado Relevante","Resolución aprobación \nCargos","Tecnología \n(GN, GNC, GNL, GLP Red)","Código \nDANE","Departamento","Municipio","Nuevo / Existente","Catastro \nPoblación","Total Residenciales \nAnillados","Usuarios Residenciales Conectados",null,null,null,null,null,"Total Comercial \nConectados","Total Industriales\n Conectados","Total Usuarios Conectados","Cobertura Residencial Potencial","Cobertura Residencial Efectiva","Observaciones"]
[null,null,null,null,null,null,null,null,null,null,"E1","E2","E3","E4","E5","E6"]
[null,null,null,null,null,{"$f":"+IF(E12=\"\",\"\",VLOOKUP(E12,DANE!$A$2:$E$1123,2,0))","v":""},{"$f":"+IF(E12=\"\",\"\",VLOOKUP(E12,DANE!$A$2:$E$1123,4,0))","v":""},null,null,null,null,null,null,null,null,null,null,null,{"$f":"+IF(SUM(K12:R12)=0,\"\",SUM(K12:R12))","v":""},{"$f":"+IFERROR(J12/I12,\"\")","v":""},{"$f":"+IFERROR(SUM(K12:P12)/I12,\"\")","v":""}]
[null,null,null,null,null,{"$f":"+IF(E13=\"\",\"\",VLOOKUP(E13,DANE!$A$2:$E$1123,2,0))","v":""},{"$f":"+IF(E13=\"\",\"\",VLOOKUP(E13,DANE!$A$2:$E$1123,4,0))","v":""},null,null,null,null,null,null,null,null,null,null,null,{"$f":"+IF(SUM(K13:R13)=0,\"\",SUM(K13:R13))","v":""},{"$f":"+IFERROR(J13/I13,\"\")","v":""},{"$f":"+IFERROR(SUM(K13:P13)/I13,\"\")","v":""}]
[null,null,null,null,null,{"$f":"+IF(E14=\"\",\"\",VLOOKUP(E14,DANE!$A$2:$E$1123,2,0))","v":""},{"$f":"+IF(E14=\"\",\"\",VLOOKUP(E14,DANE!$A$2:$E$1123,4,0))","v":""},null,null,null,null,null,null,null,null,null,null,null,"","",""]
[null,null,null,null,null,{"$f":"+IF(E15=\"\",\"\",VLOOKUP(E15,DANE!$A$2:$E$1123,2,0))","v":""},{"$f":"+IF(E15=\"\",\"\",VLOOKUP(E15,DANE!$A$2:$E$1123,4,0))","v":""},null,null,null,null,null,null,null,null,null,null,null,"","",""]
[null,null,null,null,null,{"$f":"+IF(E16=\"\",\"\",VLOOKUP(E16,DANE!$A$2:$E$1123,2,0))","v":""},{"$f":"+IF(E16=\"\",\"\",VLOOKUP(E16,DANE!$A$2:$E$1123,4,0))","v":""},null,null,null,null,null,null,null,null,null,null,null,"","",""]
[null,null,null,null,null,{"$f":"+IF(E17=\"\",\"\",VLOOKUP(E17,DANE!$A$2:$E$1123,2,0))","v":""},{"$f":"+IF(E17=\"\",\"\",VLOOKUP(E17,DANE!$A$2:$E$1123,4,0))","v":""},null,null,null,null,null,null,null,null,null,null,null,"","",""]
[null,null,null,null,null,{"$f":"+IF(E18=\"\",\"\",VLOOKUP(E18,DANE!$A$2:$E$1123,2,0))","v":""},{"$f":"+IF(E18=\"\",\"\",VLOOKUP(E18,DANE!$A$2:$E$1123,4,0))","v":""},null,null,null,null,null,null,null,null,null,null,null,"","",""]
[null,null,null,null,null,{"$f":"+IF(E19=\"\",\"\",VLOOKUP(E19,DANE!$A$2:$E$1123,2,0))","v":""},{"$f":"+IF(E19=\"\",\"\",VLOOKUP(E19,DANE!$A$2:$E$1123,4,0))","v":""},null,null,null,null,null,null,null,null,null,null,null,"","",""]
[null,null,null,null,null,{"$f":"+IF(E20=\"\",\"\",VLOOKUP(E20,DANE!$A$2:$E$1123,2,0))","v":""},{"$f":"+IF(E20=\"\",\"\",VLOOKUP(E20,DANE!$A$2:$E$1123,4,0))","v":""},null,null,null,null,null,null,null,null,null,null,null,"","",""]
[null,null,null,null,null,{"$f":"+IF(E21=\"\",\"\",VLOOKUP(E21,DANE!$A$2:$E$1123,2,0))","v":""},{"$f":"+IF(E21=\"\",\"\",VLOOKUP(E21,DANE!$A$2:$E$1123,4,0))","v":""},null,null,null,null,null,null,null,null,null,null,null,"","",""]
[null,null,null,null,null,{"$f":"+IF(E22=\"\",\"\",VLOOKUP(E22,DANE!$A$2:$E$1123,2,0))","v":""},{"$f":"+IF(E22=\"\",\"\",VLOOKUP(E22,DANE!$A$2:$E$1123,4,0))","v":""},null,null,null,null,null,null,null,null,null,null,null,"","",""]
[null,null,null,null,null,{"$f":"+IF(E23=\"\",\"\",VLOOKUP(E23,DANE!$A$2:$E$1123,2,0))","v":""},{"$f":"+IF(E23=\"\",\"\",VLOOKUP(E23,DANE!$A$2:$E$1123,4,0))","v":""},null,null,null,null,null,null,null,null,null,null,null,"","",""]
[null,null,null,null,null,{"$f":"+IF(E24=\"\",\"\",VLOOKUP(E24,DANE!$A$2:$E$1123,2,0))","v":""},{"$f":"+IF(E24=\"\",\"\",VLOOKUP(E24,DANE!$A$2:$E$1123,4,0))","v":""},null,null,null,null,null,null,null,null,null,null,null,"","",""]
[null,null,null,null,null,{"$f":"+IF(E25=\"\",\"\",VLOOKUP(E25,DANE!$A$2:$E$1123,2,0))","v":""},{"$f":"+IF(E25=\"\",\"\",VLOOKUP(E25,DANE!$A$2:$E$1123,4,0))","v":""},null,null,null,null,null,null,null,null,null,null,null,"","",""]
[null,null,null,null,null,{"$f":"+IF(E26=\"\",\"\",VLOOKUP(E26,DANE!$A$2:$E$1123,2,0))","v":""},{"$f":"+IF(E26=\"\",\"\",VLOOKUP(E26,DANE!$A$2:$E$1123,4,0))","v":""},null,null,null,null,null,null,null,null,null,null,null,"","",""]
[null,null,null,null,null,{"$f":"+IF(E27=\"\",\"\",VLOOKUP(E27,DANE!$A$2:$E$1123,2,0))","v":""},{"$f":"+IF(E27=\"\",\"\",VLOOKUP(E27,DANE!$A$2:$E$1123,4,0))","v":""},null,null,null,null,null,null,null,null,null,null,null,"","",""]
[null,null,null,null,null,{"$f":"+IF(E28=\"\",\"\",VLOOKUP(E28,DANE!$A$2:$E$1123,2,0))","v":""},{"$f":"+IF(E28=\"\",\"\",VLOOKUP(E28,DANE!$A$2:$E$1123,4,0))","v":""},null,null,null,null,null,null,null,null,null,null,null,"","",""]
[null,null,null,null,null,{"$f":"+IF(E29=\"\",\"\",VLOOKUP(E29,DANE!$A$2:$E$1123,2,0))","v":""},{"$f":"+IF(E29=\"\",\"\",VLOOKUP(E29,DANE!$A$2:$E$1123,4,0))","v":""},null,null,null,null,null,null,null,null,null,null,null,"","",""]
[null,null,null,null,null,{"$f":"+IF(E30=\"\",\"\",VLOOKUP(E30,DANE!$A$2:$E$1123,2,0))","v":""},{"$f":"+IF(E30=\"\",\"\",VLOOKUP(E30,DANE!$A$2:$E$1123,4,0))","v":""},null,null,null,null,null,null,null,null,null,null,null,"","",""]
{"$rows_left_out":124}
{"sheet":"Dato_Empresas","index":1,"n_rows":94,"n_cols":6,"rows_kept":94,"cut":false,"hidden":true,"merged":[]}
["Nombre","Nit","Actividad","Representante Legal","Cargo","COD FSSRI"]
["ALCANOS DE COLOMBIA S.A. E.S.P. ","891101577-4","Comercializador","CAMILO ERNESTO LOZANO HERMIDA","Gerente General",1324]
["ARAUCANA DE GASES S.A.S","901390944-8","Comercializador","RICARDO ALVAREZ HIGUERA","Gerente General",1408]
["C&DGAS S.A.S ESP ","900440491-5","Comercializador","JAVIER DARIO PEREA BARROSO","Gerente General",1389]
["CENTRAL GAS S.A.S ESP","901599899-3","Comercializador","CARLOS PUENTES OBREGON","Gerente",1409]
["CIAZ SAS ESP","804011155-7","Comercializador","SERGIO ANDRES QUINTERO ALBARRACIN","Representante Legal",1425]
["COINOGAS S.A. ESP","900100553-5","Comercializador","GERARDO CUADROS CHAHIN","Gerente",1412]
["COLGAS S.A. E.S.P.","890500726-3","Comercializador","ANDRES JULIAN CADAVID MOLINA","Suplente Gerente",1345]
["COLOMBIAN ENERGY GROUP S.A.S ESP - GRENCOL ","900957357-6","Comercializador","MAURICIO FIDEL CASTILLO RINCON ","Gerente General",1390]
["COMPAÑIA NACIONAL DE INGENIERA Y CONSTRUCCION PARA GAS SERVICIOS PUBLICOS SAS ESP ZOMAC - COINCOLGAS","901624016-4","Comercializador","ORLANDO LEDESMA MONTILLA","Representante Legal",1421]
["COMPAÑIA NACIONAL DE INGENIERIA Y GAS DEL CHAIRA S.A.S E.S.P BIC - CONGASCHAIRA","901876244-8","Comercializador","IGNACIO RODRIGUEZ FLORES","Representante Legal",1422]
["COMPRIGAS S.A.S ESP","901020967-0","Comercializador","YEISON DAVID VASQUEZ HIDALGO","Representante Legal",1392]
["CONSTRUCCION E INGENIERIA DE GAS COLOMBIA S.A.S E.S.P - COINGASCO S.A ESP","901355090-5","Comercializador","JONATHAN ALEJANDRO LEON CARDENAS","Representante Legal",1410]
["CONSTRUCTORA Y DISTRIBUIDORA DE SERVICIOS PUBLICOS DOMICILIARIOS SAS ESP - DISTRISERVICIOS ","901105922-6","Comercializador","HERNAN DARIO HUERTAS MURCIA","Gerente General",1399]
["DISTICON S.A.S ESP","900563448-6","Comercializador","CARLOS RAMON CASTAÑEDA ","Representante Legal",1370]
["DISTRIBUIDORA Y COMERCIALIZADORA DE GAS Y ENERGIAS ALTERNATIVAS - DYGAS SAS ESP","901464472-2","Comercializador","JAVIER DARÍO PEREA BARROSO","Gerente General",1404]
["DUEMAV CORP SAS ESP","901385470-9","Comeercializador Mayorista","DANIEL UMAÑA ECHEVERRIA","Representante Legal",1431]
["EFIGAS S.A. E.S.P. - CALDAS-RISARALDA-QUINDIO","800202395-3","Comercializador","CARLOS ALBERTO MAZENETH DAVILA","Gerente",1308]
["EMPRESA COMUNITARIA DE ACUEDUCTO, ALCANTARILLADO Y ASEO DE SARAVENA - ECAAAS ESP","800163392-3","Distribuidor","ASAEL TORRES","Representante Legal",1401]
["EMPRESA DE ENERGÍA DEL CASANARE - ENERCA S.A. E.S.P.","844004576-0","Comercializador","JORGE ELBERTO TORRES MENDOZA","Gerente General",1331]
["EMPRESA INTEGRAL DE SERVICIOS OP&S CONSTRUCCIONES S.A. E.S.P.","809010690-1","Comercializador","CARLOS PUENTES OBREGON","Gerente",1357]
["EMPRESA MUNICIPAL DE SERVICIOS PÚBLICOS DE OROCUE S.A. E.S.P.","900251955-1","Comercializador","LINO CEDEÑO COLINA","Gerente",1359]
["EMPRESA PRIVADA DE SERVICIOS PÚBLICOS DE LA AMAZONÍA  - EPSAS S.A.S","901175206-1","Comercializador","ALEXANDER SUAREZ SANCHEZ","Representante Legal",1394]
["EMPRESAS PÚBLICAS DE MEDELLÍN - EPM E.S.P.","890904996-1","Comercializador","JUAN ESTEBAN CALLE RESTREPO","Gerente General",1250]
["EMPRESAS PÚBLICAS DEL QUINDÍO EPQ S.A ESP","800063823-7","Comercializador","JAMES PADILLA GARCÍA ","Gerente General",1374]
["ENERCER S.A. ESP ","830140206-1","Comercializador","CARLOS ARTURO AVILA VERA","Gerente",1333]
["EOS Energy S.A.S. E.S.P.","901034973-6","Comercializador","ALEJANDRO GIRALDO VASQUEZ","Representante Legal",1380]
["ESPIGAS S.A. E.S.P.","804014885-9","Comercializador","JORGE LUIS ESCALANTE HERNANDEZ","Gerente",1329]
["G8 PROYECTOS ENERGÉTICOS S.A.S. E.S.P.","900542835-3","Comercializador","ALBERTO ENRIQUE ALFARO ARIAS","Gerente",1364]
["GAS NATURAL CUNDIBOYACENSE S.A. E.S.P. ","830045472-8","Comercializador","RICARDO ANTONIO DONADO ARENAS","Representante Legal",1315]
{"$rows_left_out":65}
{"sheet":"DANE","index":2,"n_rows":1123,"n_cols":13,"rows_kept":1123,"cut":false,"hidden":true,"merged":[]}
["Código DANE","Nombre Departamento","Código Departamento","Nombre Municipio","Código Municipio","DeptoMcpio","Código DANE",null,"Nombre Departamento","Código Deapartamento",null,"GN","Nuevo"]
["05001","ANTIOQUIA","05","MEDELLIN","001",{"$f":"+B2&D2","v":"ANTIOQUIAMEDELLIN"},{"$f":"+CONCATENATE(C2,E2)","v":"05001"},null,"ANTIOQUIA","05",null,"GLP Red","Existente"]
["05002","ANTIOQUIA","05","ABEJORRAL","002",{"$f":"+B3&D3","v":"ANTIOQUIAABEJORRAL"},"05002",null,"ATLANTICO","08",null,"GNC"]
["05004","ANTIOQUIA","05","ABRIAQUI","004","ANTIOQUIAABRIAQUI","05004",null,"BOGOTA","11",null,"GNL"]
["05021","ANTIOQUIA","05","ALEJANDRIA","021","ANTIOQUIAALEJANDRIA","05021",null,"BOLIVAR","13"]
["05030","ANTIOQUIA","05","AMAGA","030","ANTIOQUIAAMAGA","05030",null,"BOYACA","15"]
["05031","ANTIOQUIA","05","AMALFI","031","ANTIOQUIAAMALFI","05031",null,"CALDAS","17"]
["05034","ANTIOQUIA","05","ANDES","034","ANTIOQUIAANDES","05034",null,"CAQUETA","18"]
["05036","ANTIOQUIA","05","ANGELOPOLIS","036","ANTIOQUIAANGELOPOLIS","05036",null,"CAUCA","19"]
["05038","ANTIOQUIA","05","ANGOSTURA","038","ANTIOQUIAANGOSTURA","05038",null,"CESAR","20"]
["05040","ANTIOQUIA","05","ANORI","040","ANTIOQUIAANORI","05040",null,"CORDOBA","23"]
["05042","ANTIOQUIA","05","SANTAFE DE ANTIOQUIA","042","ANTIOQUIASANTAFE DE ANTIOQUIA","05042",null,"CUNDINAMARCA","25"]
["05044","ANTIOQUIA","05","ANZA","044","ANTIOQUIAANZA","05044",null,"CHOCO","27"]
["05045","ANTIOQUIA","05","APARTADO","045","ANTIOQUIAAPARTADO","05045",null,"HUILA","41"]
["05051","ANTIOQUIA","05","ARBOLETES","051","ANTIOQUIAARBOLETES","05051",null,"LA GUAJIRA","44"]
["05055","ANTIOQUIA","05","ARGELIA","055","ANTIOQUIAARGELIA","05055",null,"MAGDALENA","47"]
["05059","ANTIOQUIA","05","ARMENIA","059","ANTIOQUIAARMENIA","05059",null,"META","50"]
["05079","ANTIOQUIA","05","BARBOSA","079","ANTIOQUIABARBOSA","05079",null,"NARIÑO","52"]
["05086","ANTIOQUIA","05","BELMIRA","086","ANTIOQUIABELMIRA","05086",null,"N. DE SANTANDER","54"]
["05088","ANTIOQUIA","05","BELLO","088","ANTIOQUIABELLO","05088",null,"QUINDIO","63"]
["05091","ANTIOQUIA","05","BETANIA","091","ANTIOQUIABETANIA","05091",null,"RISARALDA","66"]
["05093","ANTIOQUIA","05","BETULIA","093","ANTIOQUIABETULIA","05093",null,"SANTANDER","68"]
["05101","ANTIOQUIA","05","CIUDAD BOLIVAR","101","ANTIOQUIACIUDAD BOLIVAR","05101",null,"SUCRE","70"]
["05107","ANTIOQUIA","05","BRICEÑO","107","ANTIOQUIABRICEÑO","05107",null,"TOLIMA","73"]
["05113","ANTIOQUIA","05","BURITICA","113","ANTIOQUIABURITICA","05113",null,"VALLE DEL CAUCA","76"]
["05120","ANTIOQUIA","05","CACERES","120","ANTIOQUIACACERES","05120",null,"ARAUCA","81"]
["05125","ANTIOQUIA","05","CAICEDO","125","ANTIOQUIACAICEDO","05125",null,"CASANARE","85"]
["05129","ANTIOQUIA","05","CALDAS","129","ANTIOQUIACALDAS","05129",null,"PUTUMAYO","86"]
["05134","ANTIOQUIA","05","CAMPAMENTO","134","ANTIOQUIACAMPAMENTO","05134",null,"SAN ANDRES","88"]
["05138","ANTIOQUIA","05","CAÑASGORDAS","138","ANTIOQUIACAÑASGORDAS","05138",null,"AMAZONAS","91"]
{"$rows_left_out":1094}
{"sheet":"Mcpio","index":3,"n_rows":126,"n_cols":33,"rows_kept":126,"cut":false,"hidden":true,"merged":[]}
["ANTIOQUIA","ATLANTICO","BOGOTA","BOLIVAR","BOYACA","CALDAS","CAQUETA","CAUCA","CESAR","CORDOBA","CUNDINAMARCA","CHOCO","HUILA","LA GUAJIRA","MAGDALENA","META","NARIÑO","N. DE SANTANDER","QUINDIO","RISARALDA","SANTANDER","SUCRE","TOLIMA","VALLE DEL CAUCA","ARAUCA","CASANARE","PUTUMAYO","SAN ANDRES","AMAZONAS","GUAINIA","GUAVIARE","VAUPES","VICHADA"]
["ABEJORRAL","BARANOA","BOGOTA, D.C.","ACHI","ALMEIDA","AGUADAS","ALBANIA","ALMAGUER","AGUACHICA","AYAPEL","AGUA DE DIOS","ACANDI","ACEVEDO","ALBANIA","ALGARROBO","ACACIAS","ALBAN","ABREGO","ARMENIA","APIA","AGUADA","BUENAVISTA","ALPUJARRA","ALCALA","ARAUCA","AGUAZUL","COLON","SAN ANDRES","EL ENCANTO","INIRIDA","CALAMAR","CARURU","CUMARIBO"]
["ABRIAQUI","BARRANQUILLA",null,"ALTOS DEL ROSARIO","AQUITANIA","ANSERMA","BELEN DE LOS ANDAQUIES","ARGELIA","AGUSTIN CODAZZI","BUENAVISTA","ALBAN","ALTO BAUDO","AGRADO","BARRANCAS","ARACATACA","BARRANCA DE UPIA","ALDANA","ARBOLEDAS","BUENAVISTA","BALBOA","ALBANIA","CAIMITO","ALVARADO","ANDALUCIA","ARAUQUITA","CHAMEZA","MOCOA","PROVIDENCIA","LA CHORRERA","BARRANCO MINAS","EL RETORNO","MITU","LA PRIMAVERA"]
["ALEJANDRIA","CAMPO DE LA CRUZ",null,"ARENAL","ARCABUCO","ARANZAZU","CARTAGENA DEL CHAIRA","BALBOA","ASTREA","CANALETE","ANAPOIMA","ATRATO","AIPE","DIBULLA","ARIGUANI","CABUYARO","ANCUYA","BOCHALEMA","CALARCA","BELEN DE UMBRIA","ARATOCA","COLOSO","AMBALEMA","ANSERMANUEVO","CRAVO NORTE","HATO COROZAL","ORITO",null,"LA PEDRERA","MAPIRIPANA","MIRAFLORES","PACOA","PUERTO CARREÑO"]
["AMAGA","CANDELARIA",null,"ARJONA","BELEN","BELALCAZAR","CURILLO","BOLIVAR","BECERRIL","CERETE","ANOLAIMA","BAGADO","ALGECIRAS","DISTRACCION","CERRO SAN ANTONIO","CASTILLA LA NUEVA","ARBOLEDA","BUCARASICA","CIRCASIA","DOSQUEBRADAS","BARBOSA","COROZAL","ANZOATEGUI","ARGELIA","FORTUL","LA SALINA","PUERTO ASIS",null,"LA VICTORIA","SAN FELIPE","SAN JOSE DEL GUAVIARE","TARAIRA","SANTA ROSALIA"]
["AMALFI","GALAPA",null,"ARROYOHONDO","BERBEO","CHINCHINA","EL DONCELLO","BUENOS AIRES","BOSCONIA","CHIMA","ARBELAEZ","BAHIA SOLANO","ALTAMIRA","EL MOLINO","CHIBOLO","CUBARRAL","BARBACOAS","CACOTA","CORDOBA","GUATICA","BARICHARA","COVEÑAS","ARMERO","BOLIVAR","PUERTO RONDON","MANI","PUERTO CAICEDO",null,"LETICIA","PUERTO COLOMBIA",null,"PAPUNAUA"]
["ANDES","JUAN DE ACOSTA",null,"BARRANCO DE LOBA","BETEITIVA","FILADELFIA","EL PAUJIL","CAJIBIO","CHIMICHAGUA","CHINU","BELTRAN","BAJO BAUDO","BARAYA","FONSECA","CIENAGA","CUMARAL","BELEN","CACHIRA","FILANDIA","LA CELIA","BARRANCABERMEJA","CHALAN","ATACO","BUENAVENTURA","SARAVENA","MONTERREY","PUERTO GUZMAN",null,"MIRITI - PARANA","LA GUADALUPE",null,"YAVARATE"]
["ANGELOPOLIS","LURUACO",null,"CALAMAR","BOAVITA","LA DORADA","FLORENCIA","CALDONO","CHIRIGUANA","CIENAGA DE ORO","BITUIMA","BOJAYA","CAMPOALEGRE","HATONUEVO","CONCORDIA","EL CALVARIO","BUESACO","CHINACOTA","GENOVA","LA VIRGINIA","BETULIA","EL ROBLE","CAJAMARCA","GUADALAJARA DE BUGA","TAME","NUNCHIA","LEGUIZAMO",null,"PUERTO ALEGRIA","CACAHUAL"]
["ANGOSTURA","MALAMBO",null,"CANTAGALLO","BOYACA","LA MERCED","LA MONTAÑITA","CALOTO","CURUMANI","COTORRA","BOJACA","EL CANTON DEL SAN PABLO","COLOMBIA","LA JAGUA DEL PILAR","EL BANCO","EL CASTILLO","COLON","CHITAGA","LA TEBAIDA","MARSELLA","BOLIVAR","GALERAS","CARMEN DE APICALA","BUGALAGRANDE",null,"OROCUE","SIBUNDOY",null,"PUERTO ARICA","PANA PANA"]
["ANORI","MANATI",null,"CARTAGENA","BRICEÑO","MANIZALES","MILAN","CORINTO","EL COPEY","LA APARTADA","CABRERA","CARMEN DEL DARIEN","ELIAS","MAICAO","EL PIÑON","EL DORADO","CONSACA","CONVENCION","MONTENEGRO","MISTRATO","BUCARAMANGA","GUARANDA","CASABIANCA","CAICEDONIA",null,"PAZ DE ARIPORO","SAN FRANCISCO",null,"PUERTO NARIÑO","MORICHAL"]
["SANTAFE DE ANTIOQUIA","PALMAR DE VARELA",null,"CICUCO","BUENAVISTA","MANZANARES","MORELIA","EL TAMBO","EL PASO","LORICA","CACHIPAY","CERTEGUI","GARZON","MANAURE","EL RETEN","FUENTE DE ORO","CONTADERO","CUCUTA","PIJAO","PEREIRA","CABRERA","LA UNION","CHAPARRAL","CALI",null,"PORE","SAN MIGUEL",null,"PUERTO SANTANDER"]
["ANZA","PIOJO",null,"CORDOBA","BUSBANZA","MARMATO","PUERTO RICO","FLORENCIA","GAMARRA","LOS CORDOBAS","CAJICA","CONDOTO","GIGANTE","RIOHACHA","FUNDACION","GRANADA","CORDOBA","CUCUTILLA","QUIMBAYA","PUEBLO RICO","CALIFORNIA","LOS PALMITOS","COELLO","CALIMA",null,"RECETOR","SANTIAGO",null,"TARAPACA"]
["APARTADO","POLONUEVO",null,"CLEMENCIA","CALDAS","MARQUETALIA","SAN JOSE DEL FRAGUA","GUACHENE","GONZALEZ","MOMIL","CAPARRAPI","EL CARMEN DE ATRATO","GUADALUPE","SAN JUAN DEL CESAR","GUAMAL","GUAMAL","CUASPUD","DURANIA","SALENTO","QUINCHIA","CAPITANEJO","MAJAGUAL","COYAIMA","CANDELARIA",null,"SABANALARGA","VALLE DEL GUAMUEZ"]
["ARBOLETES","PONEDERA",null,"EL CARMEN DE BOLIVAR","CAMPOHERMOSO","MARULANDA","SAN VICENTE DEL CAGUAN","GUAPI","LA GLORIA","MONTELIBANO","CAQUEZA","EL LITORAL DEL SAN JUAN","HOBO","URIBIA","NUEVA GRANADA","MAPIRIPAN","CUMBAL","EL CARMEN",null,"SANTA ROSA DE CABAL","CARCASI","MORROA","CUNDAY","CARTAGO",null,"SACAMA","VILLAGARZON"]
["ARGELIA","PUERTO COLOMBIA",null,"EL GUAMO","CERINZA","NEIRA","SOLANO","INZA","LA JAGUA DE IBIRICO","MONTERIA","CARMEN DE CARUPA","ISTMINA","IQUIRA","URUMITA","PEDRAZA","MESETAS","CUMBITARA","EL TARRA",null,"SANTUARIO","CEPITA","OVEJAS","DOLORES","DAGUA",null,"SAN LUIS DE PALENQUE"]
["ARMENIA","REPELON",null,"EL PEÑON","CHINAVITA","NORCASIA","SOLITA","JAMBALO","MANAURE","MOÑITOS","CHAGUANI","JURADO","ISNOS","VILLANUEVA","PIJIÑO DEL CARMEN","LA MACARENA","CHACHAGsI","EL ZULIA",null,null,"CERRITO","PALMITO","ESPINAL","EL AGUILA",null,"TAMARA"]
["BARBOSA","SABANAGRANDE",null,"HATILLO DE LOBA","CHIQUINQUIRA","PACORA","VALPARAISO","LA SIERRA","PAILITAS","PLANETA RICA","CHIA","LLORO","LA ARGENTINA",null,"PIVIJAY","URIBE","EL CHARCO","GRAMALOTE",null,null,"CHARALA","SAMPUES","FALAN","EL CAIRO",null,"TAURAMENA"]
["BELMIRA","SABANALARGA",null,"MAGANGUE","CHISCAS","PALESTINA",null,"LA VEGA","PELAYA","PUEBLO NUEVO","CHIPAQUE","MEDIO ATRATO","LA PLATA",null,"PLATO","LEJANIAS","EL PEÑOL","HACARI",null,null,"CHARTA","SAN BENITO ABAD","FLANDES","EL CERRITO",null,"TRINIDAD"]
["BELLO","SANTA LUCIA",null,"MAHATES","CHITA","PENSILVANIA",null,"LOPEZ","PUEBLO BELLO","PUERTO ESCONDIDO","CHOACHI","MEDIO BAUDO","NATAGA",null,"PUEBLOVIEJO","PUERTO CONCORDIA","EL ROSARIO","HERRAN",null,null,"CHIMA","SAN JUAN DE BETULIA","FRESNO","EL DOVIO",null,"VILLANUEVA"]
["BETANIA","SANTO TOMAS",null,"MARGARITA","CHITARAQUE","RIOSUCIO",null,"MERCADERES","RIO DE ORO","PUERTO LIBERTADOR","CHOCONTA","MEDIO SAN JUAN","NEIVA",null,"REMOLINO","PUERTO GAITAN","EL TABLON DE GOMEZ","LABATECA",null,null,"CHIPATA","SAN MARCOS","GUAMO","FLORIDA",null,"YOPAL"]
["BETULIA","SOLEDAD",null,"MARIA LA BAJA","CHIVATA","RISARALDA",null,"MIRANDA","LA PAZ","PURISIMA","COGUA","NOVITA","OPORAPA",null,"SABANAS DE SAN ANGEL","PUERTO LOPEZ","EL TAMBO","LA ESPERANZA",null,null,"CIMITARRA","SAN ONOFRE","HERVEO","GINEBRA"]
["CIUDAD BOLIVAR","SUAN",null,"MONTECRISTO","CIENEGA","SALAMINA",null,"MORALES","SAN ALBERTO","SAHAGUN","COTA","NUQUI","PAICOL",null,"SALAMINA","PUERTO LLERAS","FUNES","LA PLAYA",null,null,"CONCEPCION","SAN PEDRO","HONDA","GUACARI"]
["BRICEÑO","TUBARA",null,"MOMPOS","COMBITA","SAMANA",null,"PADILLA","SAN DIEGO","SAN ANDRES SOTAVENTO","CUCUNUBA","QUIBDO","PALERMO",null,"SAN SEBASTIAN DE BUENAVISTA","PUERTO RICO","GUACHUCAL","LOS PATIOS",null,null,"CONFINES","SAN LUIS DE SINCE","IBAGUE","JAMUNDI"]
["BURITICA","USIACURI",null,"NOROSI","COPER","SAN JOSE",null,"PAEZ","SAN MARTIN","SAN ANTERO","EL COLEGIO","RIO IRO","PALESTINA",null,"SAN ZENON","RESTREPO","GUAITARILLA","LOURDES",null,null,"CONTRATACION","SUCRE","ICONONZO","LA CUMBRE"]
["CACERES",null,null,"MORALES","CORRALES","SUPIA",null,"PATIA","TAMALAMEQUE","SAN BERNARDO DEL VIENTO","EL PEÑON","RIO QUITO","PITAL",null,"SANTA ANA","SAN CARLOS DE GUAROA","GUALMATAN","MUTISCUA",null,null,"COROMORO","SANTIAGO DE TOLU","LERIDA","LA UNION"]
["CAICEDO",null,null,"PINILLOS","COVARACHIA","VICTORIA",null,"PIAMONTE","VALLEDUPAR","SAN CARLOS","EL ROSAL","RIOSUCIO","PITALITO",null,"SANTA BARBARA DE PINTO","SAN JUAN DE ARAMA","ILES","OCAÑA",null,null,"CURITI","SINCELEJO","LIBANO","LA VICTORIA"]
["CALDAS",null,null,"REGIDOR","CUBARA","VILLAMARIA",null,"PIENDAMO",null,"SAN PELAYO","FACATATIVA","SAN JOSE DEL PALMAR","RIVERA",null,"SANTA MARTA","SAN JUANITO","IMUES","PAMPLONA",null,null,"EL CARMEN DE CHUCURI","TOLU VIEJO","MARIQUITA","OBANDO"]
["CAMPAMENTO",null,null,"RIO VIEJO","CUCAITA","VITERBO",null,"POPAYAN",null,"TIERRALTA","FOMEQUE","SIPI","SALADOBLANCO",null,"SITIONUEVO","SAN MARTIN","IPIALES","PAMPLONITA",null,null,"EL GUACAMAYO",null,"MELGAR","PALMIRA"]
["CAÑASGORDAS",null,null,"SAN CRISTOBAL","CUITIVA",null,null,"PUERTO TEJADA",null,"VALENCIA","FOSCA","TADO","SAN AGUSTIN",null,"TENERIFE","VILLAVICENCIO","LA CRUZ","PUERTO SANTANDER",null,null,"EL PEÑON",null,"MURILLO","PRADERA"]
["CARACOLI",null,null,"SAN ESTANISLAO","CHIQUIZA",null,null,"PURACE",null,null,"FUNZA","UNGUIA","SANTA MARIA",null,"ZAPAYAN","VISTAHERMOSA","LA FLORIDA","RAGONVALIA",null,null,"EL PLAYON",null,"NATAGAIMA","RESTREPO"]
{"$rows_left_out":96}