{"text_format":"1","workbook":"xlsx","n_sheets":3,"sheets":["Comentarios","Contenido RETIE gral","Contenido RETIE esp"],"not_rendered":{"charts":0,"images":0,"macros":1,"external_links":0,"defined_names":1,"comments":0,"pivot_tables":0},"unopened":[],"bounds":{"document_bytes":16777216,"sheet_cells":100000,"rows_first":2000,"rows_last":500,"rows_between":2000,"halvings":0,"cell_chars":16384,"cell_head_chars":4096},"cells_cut":0,"cells_raw":0,"read":"whole","date_system":"1900"}

{"sheet":"Comentarios","index":0,"n_rows":101,"n_cols":6,"rows_kept":101,"cut":false,"hidden":false,"merged":[[16,0,16,5],[12,1,12,5],[14,1,14,5],[15,1,15,5],[7,1,7,5],[13,0,13,5],[8,0,8,5],[9,1,9,5],[10,1,10,5],[11,1,11,5],[1,0,2,5],[3,1,3,5],[4,1,4,5],[5,1,5,5],[6,1,6,5]]}
[]
["FORMULARIO PARA RECEPCIÓN DE COMENTARIOS DE LA CIUDADANÍA Y PARTES INTERESADAS"]
[]
["Sector: ","Energía"]
["Proyecto: Resolución","\"Por la cual se expide el nuevo Reglamento Técnico de Instalaciones Eléctricas - RETIE\""]
["Fecha inicio:","01 de marzo de 2022"]
["Fecha  fin: ","01 de mayo de 2022"]
["Fecha Comentario: "]
["Datos de contacto"]
["Nombre:"]
["Empresa:"]
["Correo electrónico:"]
["Telefono:"]
[]
["NOTA 1","En los casos que su comentario sea ajustar, modificar o eliminar algún ítem de la propuesta presentada, sugerimos incluir su debida justificación técnica"]
["NOTA 2","Favor incluir solo texto, en caso de considerar necesario el envío de información adicional como gráficos o tablas, agradecemos enviarlo al correo electrónico pciudadana@minenergia.gov.co indicando en el asunto: \"Comentarios al Proyecto de Resolución por la cual se expide el nuevo Reglamento Técnico de Instalaciones Eléctricas - RETIE\""]
[]
["TIPO DE COMENTARIO\n\n\n(De la lista desplegable seleccione si su comentario es Editorial o Técnico)","1er REFERENTE DEL ACTO ADMINISTRATIVO\n\n(De la lista desplegable seleccione alguno de los Anexos, la Resolución, o la Memoria Justificativa)","TEMA DE OBSERVACIÓN DEL 1er REFERENTE DEL ACTO ADMINISTRATIVO","2do REFERENTE DEL ACTO ADMINISTRATIVO\n\n(De la lista desplegable seleccione el Título, Artículo, Númeral, o Capítulo del que hará el comentario) ","TEMA DE OBSERVACIÓN DEL 2do REFERENTE DEL ACTO ADMINISTRATIVO","Comentario detallado y Propuesta de Modificación\n(Ver Notas 1 y 2)"]
[null,null,{"$f":"IFERROR(VLOOKUP(B19,'Contenido RETIE esp'!$A$2:$B$398,2,FALSE),\"\")","v":""},null,{"$f":"+_xlfn.IFNA(+IF(B19=\"ANEXO1\",VLOOKUP(D19,'Contenido RETIE esp'!$A$3:$B$24,2,FALSE),IF(B19=\"ANEXO2\",VLOOKUP(D19,'Contenido RETIE esp'!$A$26:$B$98,2,FALSE),IF(B19=\"ANEXO3\",VLOOKUP(D19,'Contenido RETIE esp'!$A$100:$B$303,2,FALSE),IF(B19=\"ANEXO4\",VLOOKUP(D19,'Contenido RETIE esp'!$A$305:$B$353,2,FALSE),IF(B19=\"RESOLUCIÓN\",VLOOKUP(D19,'Contenido RETIE esp'!$A$355:$B$363,2,FALSE),IF(B19=\"MEMORIAJUSTIFICATIVA\",VLOOKUP(D19,'Contenido RETIE esp'!$A$363:$B$398,2,FALSE),\"\")))))),\"\")","v":""}]
[null,null,{"$f":"IFERROR(VLOOKUP(B20,'Contenido RETIE esp'!$A$2:$B$398,2,FALSE),\"\")","v":""},null,{"$f":"+_xlfn.IFNA(+IF(B20=\"ANEXO1\",VLOOKUP(D20,'Contenido RETIE esp'!$A$3:$B$24,2,FALSE),IF(B20=\"ANEXO2\",VLOOKUP(D20,'Contenido RETIE esp'!$A$26:$B$98,2,FALSE),IF(B20=\"ANEXO3\",VLOOKUP(D20,'Contenido RETIE esp'!$A$100:$B$303,2,FALSE),IF(B20=\"ANEXO4\",VLOOKUP(D20,'Contenido RETIE esp'!$A$305:$B$353,2,FALSE),IF(B20=\"RESOLUCIÓN\",VLOOKUP(D20,'Contenido RETIE esp'!$A$355:$B$363,2,FALSE),IF(B20=\"MEMORIAJUSTIFICATIVA\",VLOOKUP(D20,'Contenido RETIE esp'!$A$363:$B$398,2,FALSE),\"\")))))),\"\")","v":""}]
[null,null,{"$f":"IFERROR(VLOOKUP(B21,'Contenido RETIE esp'!$A$2:$B$398,2,FALSE),\"\")","v":""},null,{"$f":"+_xlfn.IFNA(+IF(B21=\"ANEXO1\",VLOOKUP(D21,'Contenido RETIE esp'!$A$3:$B$24,2,FALSE),IF(B21=\"ANEXO2\",VLOOKUP(D21,'Contenido RETIE esp'!$A$26:$B$98,2,FALSE),IF(B21=\"ANEXO3\",VLOOKUP(D21,'Contenido RETIE esp'!$A$100:$B$303,2,FALSE),IF(B21=\"ANEXO4\",VLOOKUP(D21,'Contenido RETIE esp'!$A$305:$B$353,2,FALSE),IF(B21=\"RESOLUCIÓN\",VLOOKUP(D21,'Contenido RETIE esp'!$A$355:$B$363,2,FALSE),IF(B21=\"MEMORIAJUSTIFICATIVA\",VLOOKUP(D21,'Contenido RETIE esp'!$A$363:$B$398,2,FALSE),\"\")))))),\"\")","v":""}]
[null,null,{"$f":"IFERROR(VLOOKUP(B22,'Contenido RETIE esp'!$A$2:$B$398,2,FALSE),\"\")","v":""},null,{"$f":"+_xlfn.IFNA(+IF(B22=\"ANEXO1\",VLOOKUP(D22,'Contenido RETIE esp'!$A$3:$B$24,2,FALSE),IF(B22=\"ANEXO2\",VLOOKUP(D22,'Contenido RETIE esp'!$A$26:$B$98,2,FALSE),IF(B22=\"ANEXO3\",VLOOKUP(D22,'Contenido RETIE esp'!$A$100:$B$303,2,FALSE),IF(B22=\"ANEXO4\",VLOOKUP(D22,'Contenido RETIE esp'!$A$305:$B$353,2,FALSE),IF(B22=\"RESOLUCIÓN\",VLOOKUP(D22,'Contenido RETIE esp'!$A$355:$B$363,2,FALSE),IF(B22=\"MEMORIAJUSTIFICATIVA\",VLOOKUP(D22,'Contenido RETIE esp'!$A$363:$B$398,2,FALSE),\"\")))))),\"\")","v":""}]
[null,null,{"$f":"IFERROR(VLOOKUP(B23,'Contenido RETIE esp'!$A$2:$B$398,2,FALSE),\"\")","v":""},null,{"$f":"+_xlfn.IFNA(+IF(B23=\"ANEXO1\",VLOOKUP(D23,'Contenido RETIE esp'!$A$3:$B$24,2,FALSE),IF(B23=\"ANEXO2\",VLOOKUP(D23,'Contenido RETIE esp'!$A$26:$B$98,2,FALSE),IF(B23=\"ANEXO3\",VLOOKUP(D23,'Contenido RETIE esp'!$A$100:$B$303,2,FALSE),IF(B23=\"ANEXO4\",VLOOKUP(D23,'Contenido RETIE esp'!$A$305:$B$353,2,FALSE),IF(B23=\"RESOLUCIÓN\",VLOOKUP(D23,'Contenido RETIE esp'!$A$355:$B$363,2,FALSE),IF(B23=\"MEMORIAJUSTIFICATIVA\",VLOOKUP(D23,'Contenido RETIE esp'!$A$363:$B$398,2,FALSE),\"\")))))),\"\")","v":""}]
[null,null,{"$f":"IFERROR(VLOOKUP(B24,'Contenido RETIE esp'!$A$2:$B$398,2,FALSE),\"\")","v":""},null,{"$f":"+_xlfn.IFNA(+IF(B24=\"ANEXO1\",VLOOKUP(D24,'Contenido RETIE esp'!$A$3:$B$24,2,FALSE),IF(B24=\"ANEXO2\",VLOOKUP(D24,'Contenido RETIE esp'!$A$26:$B$98,2,FALSE),IF(B24=\"ANEXO3\",VLOOKUP(D24,'Contenido RETIE esp'!$A$100:$B$303,2,FALSE),IF(B24=\"ANEXO4\",VLOOKUP(D24,'Contenido RETIE esp'!$A$305:$B$353,2,FALSE),IF(B24=\"RESOLUCIÓN\",VLOOKUP(D24,'Contenido RETIE esp'!$A$355:$B$363,2,FALSE),IF(B24=\"MEMORIAJUSTIFICATIVA\",VLOOKUP(D24,'Contenido RETIE esp'!$A$363:$B$398,2,FALSE),\"\")))))),\"\")","v":""}]
[null,null,{"$f":"IFERROR(VLOOKUP(B25,'Contenido RETIE esp'!$A$2:$B$398,2,FALSE),\"\")","v":""},null,{"$f":"+_xlfn.IFNA(+IF(B25=\"ANEXO1\",VLOOKUP(D25,'Contenido RETIE esp'!$A$3:$B$24,2,FALSE),IF(B25=\"ANEXO2\",VLOOKUP(D25,'Contenido RETIE esp'!$A$26:$B$98,2,FALSE),IF(B25=\"ANEXO3\",VLOOKUP(D25,'Contenido RETIE esp'!$A$100:$B$303,2,FALSE),IF(B25=\"ANEXO4\",VLOOKUP(D25,'Contenido RETIE esp'!$A$305:$B$353,2,FALSE),IF(B25=\"RESOLUCIÓN\",VLOOKUP(D25,'Contenido RETIE esp'!$A$355:$B$363,2,FALSE),IF(B25=\"MEMORIAJUSTIFICATIVA\",VLOOKUP(D25,'Contenido RETIE esp'!$A$363:$B$398,2,FALSE),\"\")))))),\"\")","v":""}]
[null,null,{"$f":"IFERROR(VLOOKUP(B26,'Contenido RETIE esp'!$A$2:$B$398,2,FALSE),\"\")","v":""},null,{"$f":"+_xlfn.IFNA(+IF(B26=\"ANEXO1\",VLOOKUP(D26,'Contenido RETIE esp'!$A$3:$B$24,2,FALSE),IF(B26=\"ANEXO2\",VLOOKUP(D26,'Contenido RETIE esp'!$A$26:$B$98,2,FALSE),IF(B26=\"ANEXO3\",VLOOKUP(D26,'Contenido RETIE esp'!$A$100:$B$303,2,FALSE),IF(B26=\"ANEXO4\",VLOOKUP(D26,'Contenido RETIE esp'!$A$305:$B$353,2,FALSE),IF(B26=\"RESOLUCIÓN\",VLOOKUP(D26,'Contenido RETIE esp'!$A$355:$B$363,2,FALSE),IF(B26=\"MEMORIAJUSTIFICATIVA\",VLOOKUP(D26,'Contenido RETIE esp'!$A$363:$B$398,2,FALSE),\"\")))))),\"\")","v":""}]
[null,null,{"$f":"IFERROR(VLOOKUP(B27,'Contenido RETIE esp'!$A$2:$B$398,2,FALSE),\"\")","v":""},null,{"$f":"+_xlfn.IFNA(+IF(B27=\"ANEXO1\",VLOOKUP(D27,'Contenido RETIE esp'!$A$3:$B$24,2,FALSE),IF(B27=\"ANEXO2\",VLOOKUP(D27,'Contenido RETIE esp'!$A$26:$B$98,2,FALSE),IF(B27=\"ANEXO3\",VLOOKUP(D27,'Contenido RETIE esp'!$A$100:$B$303,2,FALSE),IF(B27=\"ANEXO4\",VLOOKUP(D27,'Contenido RETIE esp'!$A$305:$B$353,2,FALSE),IF(B27=\"RESOLUCIÓN\",VLOOKUP(D27,'Contenido RETIE esp'!$A$355:$B$363,2,FALSE),IF(B27=\"MEMORIAJUSTIFICATIVA\",VLOOKUP(D27,'Contenido RETIE esp'!$A$363:$B$398,2,FALSE),\"\")))))),\"\")","v":""}]
[null,null,{"$f":"IFERROR(VLOOKUP(B28,'Contenido RETIE esp'!$A$2:$B$398,2,FALSE),\"\")","v":""},null,{"$f":"+_xlfn.IFNA(+IF(B28=\"ANEXO1\",VLOOKUP(D28,'Contenido RETIE esp'!$A$3:$B$24,2,FALSE),IF(B28=\"ANEXO2\",VLOOKUP(D28,'Contenido RETIE esp'!$A$26:$B$98,2,FALSE),IF(B28=\"ANEXO3\",VLOOKUP(D28,'Contenido RETIE esp'!$A$100:$B$303,2,FALSE),IF(B28=\"ANEXO4\",VLOOKUP(D28,'Contenido RETIE esp'!$A$305:$B$353,2,FALSE),IF(B28=\"RESOLUCIÓN\",VLOOKUP(D28,'Contenido RETIE esp'!$A$355:$B$363,2,FALSE),IF(B28=\"MEMORIAJUSTIFICATIVA\",VLOOKUP(D28,'Contenido RETIE esp'!$A$363:$B$398,2,FALSE),\"\")))))),\"\")","v":""}]
[null,null,{"$f":"IFERROR(VLOOKUP(B29,'Contenido RETIE esp'!$A$2:$B$398,2,FALSE),\"\")","v":""},null,{"$f":"+_xlfn.IFNA(+IF(B29=\"ANEXO1\",VLOOKUP(D29,'Contenido RETIE esp'!$A$3:$B$24,2,FALSE),IF(B29=\"ANEXO2\",VLOOKUP(D29,'Contenido RETIE esp'!$A$26:$B$98,2,FALSE),IF(B29=\"ANEXO3\",VLOOKUP(D29,'Contenido RETIE esp'!$A$100:$B$303,2,FALSE),IF(B29=\"ANEXO4\",VLOOKUP(D29,'Contenido RETIE esp'!$A$305:$B$353,2,FALSE),IF(B29=\"RESOLUCIÓN\",VLOOKUP(D29,'Contenido RETIE esp'!$A$355:$B$363,2,FALSE),IF(B29=\"MEMORIAJUSTIFICATIVA\",VLOOKUP(D29,'Contenido RETIE esp'!$A$363:$B$398,2,FALSE),\"\")))))),\"\")","v":""}]
[null,null,{"$f":"IFERROR(VLOOKUP(B30,'Contenido RETIE esp'!$A$2:$B$398,2,FALSE),\"\")","v":""},null,{"$f":"+_xlfn.IFNA(+IF(B30=\"ANEXO1\",VLOOKUP(D30,'Contenido RETIE esp'!$A$3:$B$24,2,FALSE),IF(B30=\"ANEXO2\",VLOOKUP(D30,'Contenido RETIE esp'!$A$26:$B$98,2,FALSE),IF(B30=\"ANEXO3\",VLOOKUP(D30,'Contenido RETIE esp'!$A$100:$B$303,2,FALSE),IF(B30=\"ANEXO4\",VLOOKUP(D30,'Contenido RETIE esp'!$A$305:$B$353,2,FALSE),IF(B30=\"RESOLUCIÓN\",VLOOKUP(D30,'Contenido RETIE esp'!$A$355:$B$363,2,FALSE),IF(B30=\"MEMORIAJUSTIFICATIVA\",VLOOKUP(D30,'Contenido RETIE esp'!$A$363:$B$398,2,FALSE),\"\")))))),\"\")","v":""}]
[null,null,{"$f":"IFERROR(VLOOKUP(B31,'Contenido RETIE esp'!$A$2:$B$398,2,FALSE),\"\")","v":""},null,{"$f":"+_xlfn.IFNA(+IF(B31=\"ANEXO1\",VLOOKUP(D31,'Contenido RETIE esp'!$A$3:$B$24,2,FALSE),IF(B31=\"ANEXO2\",VLOOKUP(D31,'Contenido RETIE esp'!$A$26:$B$98,2,FALSE),IF(B31=\"ANEXO3\",VLOOKUP(D31,'Contenido RETIE esp'!$A$100:$B$303,2,FALSE),IF(B31=\"ANEXO4\",VLOOKUP(D31,'Contenido RETIE esp'!$A$305:$B$353,2,FALSE),IF(B31=\"RESOLUCIÓN\",VLOOKUP(D31,'Contenido RETIE esp'!$A$355:$B$363,2,FALSE),IF(B31=\"MEMORIAJUSTIFICATIVA\",VLOOKUP(D31,'Contenido RETIE esp'!$A$363:$B$398,2,FALSE),\"\")))))),\"\")","v":""}]
[null,null,{"$f":"IFERROR(VLOOKUP(B32,'Contenido RETIE esp'!$A$2:$B$398,2,FALSE),\"\")","v":""},null,{"$f":"+_xlfn.IFNA(+IF(B32=\"ANEXO1\",VLOOKUP(D32,'Contenido RETIE esp'!$A$3:$B$24,2,FALSE),IF(B32=\"ANEXO2\",VLOOKUP(D32,'Contenido RETIE esp'!$A$26:$B$98,2,FALSE),IF(B32=\"ANEXO3\",VLOOKUP(D32,'Contenido RETIE esp'!$A$100:$B$303,2,FALSE),IF(B32=\"ANEXO4\",VLOOKUP(D32,'Contenido RETIE esp'!$A$305:$B$353,2,FALSE),IF(B32=\"RESOLUCIÓN\",VLOOKUP(D32,'Contenido RETIE esp'!$A$355:$B$363,2,FALSE),IF(B32=\"MEMORIAJUSTIFICATIVA\",VLOOKUP(D32,'Contenido RETIE esp'!$A$363:$B$398,2,FALSE),\"\")))))),\"\")","v":""}]
[null,null,{"$f":"IFERROR(VLOOKUP(B33,'Contenido RETIE esp'!$A$2:$B$398,2,FALSE),\"\")","v":""},null,{"$f":"+_xlfn.IFNA(+IF(B33=\"ANEXO1\",VLOOKUP(D33,'Contenido RETIE esp'!$A$3:$B$24,2,FALSE),IF(B33=\"ANEXO2\",VLOOKUP(D33,'Contenido RETIE esp'!$A$26:$B$98,2,FALSE),IF(B33=\"ANEXO3\",VLOOKUP(D33,'Contenido RETIE esp'!$A$100:$B$303,2,FALSE),IF(B33=\"ANEXO4\",VLOOKUP(D33,'Contenido RETIE esp'!$A$305:$B$353,2,FALSE),IF(B33=\"RESOLUCIÓN\",VLOOKUP(D33,'Contenido RETIE esp'!$A$355:$B$363,2,FALSE),IF(B33=\"MEMORIAJUSTIFICATIVA\",VLOOKUP(D33,'Contenido RETIE esp'!$A$363:$B$398,2,FALSE),\"\")))))),\"\")","v":""}]
[null,null,{"$f":"IFERROR(VLOOKUP(B34,'Contenido RETIE esp'!$A$2:$B$398,2,FALSE),\"\")","v":""},null,{"$f":"+_xlfn.IFNA(+IF(B34=\"ANEXO1\",VLOOKUP(D34,'Contenido RETIE esp'!$A$3:$B$24,2,FALSE),IF(B34=\"ANEXO2\",VLOOKUP(D34,'Contenido RETIE esp'!$A$26:$B$98,2,FALSE),IF(B34=\"ANEXO3\",VLOOKUP(D34,'Contenido RETIE esp'!$A$100:$B$303,2,FALSE),IF(B34=\"ANEXO4\",VLOOKUP(D34,'Contenido RETIE esp'!$A$305:$B$353,2,FALSE),IF(B34=\"RESOLUCIÓN\",VLOOKUP(D34,'Contenido RETIE esp'!$A$355:$B$363,2,FALSE),IF(B34=\"MEMORIAJUSTIFICATIVA\",VLOOKUP(D34,'Contenido RETIE esp'!$A$363:$B$398,2,FALSE),\"\")))))),\"\")","v":""}]
[null,null,{"$f":"IFERROR(VLOOKUP(B35,'Contenido RETIE esp'!$A$2:$B$398,2,FALSE),\"\")","v":""},null,{"$f":"+_xlfn.IFNA(+IF(B35=\"ANEXO1\",VLOOKUP(D35,'Contenido RETIE esp'!$A$3:$B$24,2,FALSE),IF(B35=\"ANEXO2\",VLOOKUP(D35,'Contenido RETIE esp'!$A$26:$B$98,2,FALSE),IF(B35=\"ANEXO3\",VLOOKUP(D35,'Contenido RETIE esp'!$A$100:$B$303,2,FALSE),IF(B35=\"ANEXO4\",VLOOKUP(D35,'Contenido RETIE esp'!$A$305:$B$353,2,FALSE),IF(B35=\"RESOLUCIÓN\",VLOOKUP(D35,'Contenido RETIE esp'!$A$355:$B$363,2,FALSE),IF(B35=\"MEMORIAJUSTIFICATIVA\",VLOOKUP(D35,'Contenido RETIE esp'!$A$363:$B$398,2,FALSE),\"\")))))),\"\")","v":""}]
[null,null,{"$f":"IFERROR(VLOOKUP(B36,'Contenido RETIE esp'!$A$2:$B$398,2,FALSE),\"\")","v":""},null,{"$f":"+_xlfn.IFNA(+IF(B36=\"ANEXO1\",VLOOKUP(D36,'Contenido RETIE esp'!$A$3:$B$24,2,FALSE),IF(B36=\"ANEXO2\",VLOOKUP(D36,'Contenido RETIE esp'!$A$26:$B$98,2,FALSE),IF(B36=\"ANEXO3\",VLOOKUP(D36,'Contenido RETIE esp'!$A$100:$B$303,2,FALSE),IF(B36=\"ANEXO4\",VLOOKUP(D36,'Contenido RETIE esp'!$A$305:$B$353,2,FALSE),IF(B36=\"RESOLUCIÓN\",VLOOKUP(D36,'Contenido RETIE esp'!$A$355:$B$363,2,FALSE),IF(B36=\"MEMORIAJUSTIFICATIVA\",VLOOKUP(D36,'Contenido RETIE esp'!$A$363:$B$398,2,FALSE),\"\")))))),\"\")","v":""}]
[null,null,{"$f":"IFERROR(VLOOKUP(B37,'Contenido RETIE esp'!$A$2:$B$398,2,FALSE),\"\")","v":""},null,{"$f":"+_xlfn.IFNA(+IF(B37=\"ANEXO1\",VLOOKUP(D37,'Contenido RETIE esp'!$A$3:$B$24,2,FALSE),IF(B37=\"ANEXO2\",VLOOKUP(D37,'Contenido RETIE esp'!$A$26:$B$98,2,FALSE),IF(B37=\"ANEXO3\",VLOOKUP(D37,'Contenido RETIE esp'!$A$100:$B$303,2,FALSE),IF(B37=\"ANEXO4\",VLOOKUP(D37,'Contenido RETIE esp'!$A$305:$B$353,2,FALSE),IF(B37=\"RESOLUCIÓN\",VLOOKUP(D37,'Contenido RETIE esp'!$A$355:$B$363,2,FALSE),IF(B37=\"MEMORIAJUSTIFICATIVA\",VLOOKUP(D37,'Contenido RETIE esp'!$A$363:$B$398,2,FALSE),\"\")))))),\"\")","v":""}]
[null,null,{"$f":"IFERROR(VLOOKUP(B38,'Contenido RETIE esp'!$A$2:$B$398,2,FALSE),\"\")","v":""},null,{"$f":"+_xlfn.IFNA(+IF(B38=\"ANEXO1\",VLOOKUP(D38,'Contenido RETIE esp'!$A$3:$B$24,2,FALSE),IF(B38=\"ANEXO2\",VLOOKUP(D38,'Contenido RETIE esp'!$A$26:$B$98,2,FALSE),IF(B38=\"ANEXO3\",VLOOKUP(D38,'Contenido RETIE esp'!$A$100:$B$303,2,FALSE),IF(B38=\"ANEXO4\",VLOOKUP(D38,'Contenido RETIE esp'!$A$305:$B$353,2,FALSE),IF(B38=\"RESOLUCIÓN\",VLOOKUP(D38,'Contenido RETIE esp'!$A$355:$B$363,2,FALSE),IF(B38=\"MEMORIAJUSTIFICATIVA\",VLOOKUP(D38,'Contenido RETIE esp'!$A$363:$B$398,2,FALSE),\"\")))))),\"\")","v":""}]
[null,null,{"$f":"IFERROR(VLOOKUP(B39,'Contenido RETIE esp'!$A$2:$B$398,2,FALSE),\"\")","v":""},null,{"$f":"+_xlfn.IFNA(+IF(B39=\"ANEXO1\",VLOOKUP(D39,'Contenido RETIE esp'!$A$3:$B$24,2,FALSE),IF(B39=\"ANEXO2\",VLOOKUP(D39,'Contenido RETIE esp'!$A$26:$B$98,2,FALSE),IF(B39=\"ANEXO3\",VLOOKUP(D39,'Contenido RETIE esp'!$A$100:$B$303,2,FALSE),IF(B39=\"ANEXO4\",VLOOKUP(D39,'Contenido RETIE esp'!$A$305:$B$353,2,FALSE),IF(B39=\"RESOLUCIÓN\",VLOOKUP(D39,'Contenido RETIE esp'!$A$355:$B$363,2,FALSE),IF(B39=\"MEMORIAJUSTIFICATIVA\",VLOOKUP(D39,'Contenido RETIE esp'!$A$363:$B$398,2,FALSE),\"\")))))),\"\")","v":""}]
[null,null,{"$f":"IFERROR(VLOOKUP(B40,'Contenido RETIE esp'!$A$2:$B$398,2,FALSE),\"\")","v":""},null,{"$f":"+_xlfn.IFNA(+IF(B40=\"ANEXO1\",VLOOKUP(D40,'Contenido RETIE esp'!$A$3:$B$24,2,FALSE),IF(B40=\"ANEXO2\",VLOOKUP(D40,'Contenido RETIE esp'!$A$26:$B$98,2,FALSE),IF(B40=\"ANEXO3\",VLOOKUP(D40,'Contenido RETIE esp'!$A$100:$B$303,2,FALSE),IF(B40=\"ANEXO4\",VLOOKUP(D40,'Contenido RETIE esp'!$A$305:$B$353,2,FALSE),IF(B40=\"RESOLUCIÓN\",VLOOKUP(D40,'Contenido RETIE esp'!$A$355:$B$363,2,FALSE),IF(B40=\"MEMORIAJUSTIFICATIVA\",VLOOKUP(D40,'Contenido RETIE esp'!$A$363:$B$398,2,FALSE),\"\")))))),\"\")","v":""}]
{"$rows_left_out":62}
{"sheet":"Contenido RETIE gral","index":1,"n_rows":206,"n_cols":8,"rows_kept":206,"cut":false,"hidden":true,"merged":[[0,0,0,3]]}
["Contenido RETIE general"]
["ANEXO1","ANEXO2","ANEXO3","ANEXO4","RESOLUCIÓN","MEMORIAJUSTIFICATIVA",null,"TIPO DE COMENTARIO"]
["TÍTULO 1","TÍTULO 1","TÍTULO 1","TÍTULO 1","CONSIDERANDOS",1,null,"Editorial"]
["TÍTULO 2","ARTÍCULO 2.1.1","ARTÍCULO 3.1.1","ARTÍCULO 4.1.1","RESUELVE","1.1",null,"Técnico"]
["ARTÍCULO 1.2.1","ARTÍCULO 2.1.2","3.1.1.1","4.1.1.1","ARTÍCULO 1","1.1.1"]
["ARTÍCULO 1.2.2","2.1.2.1","3.1.1.2","4.1.1.2","ARTÍCULO 2","1.1.2"]
["TÍTULO 3","2.1.2.2","ARTÍCULO 3.1.2","ARTÍCULO 4.1.2","ARTÍCULO 3","1.2"]
["ARTÍCULO 1.3.1","2.1.2.3","CAPÍTULO 1","ARTÍCULO 4.1.3","Parágrafo 1","1.2.1"]
["ARTÍCULO 1.3.2 ","TÍTULO 2","TÍTULO 2","ARTÍCULO 4.1.4","Parágrafo 2","1.2.1.1"]
["ARTÍCULO 1.3.3","ARTÍCULO 2.2.1","ARTÍCULO 3.2.1","ARTÍCULO 4.1.5","Parágrafo 3","1.2.1.2"]
["1.3.3.1","ARTÍCULO 2.2.2","ARTÍCULO 3.2.2","TÍTULO 2","ARTÍCULO 4","1.2.1.2.1"]
["1.3.3.2","TÍTULO 3","ARTÍCULO 3.2.3","ARTÍCULO 4.2.1",null,"1.2.1.2.2"]
["1.3.3.3","ARTÍCULO 2.3.1","TÍTULO 3","ARTÍCULO 4.2.2",null,"1.2.1.2.3"]
["TÍTULO 4","ARTÍCULO 2.3.2","ARTÍCULO 3.3.1","TÍTULO 3",null,"1.2.1.2.4"]
["TÍTULO 5","ARTÍCULO 2.3.3","ARTÍCULO 3.3.2","ARTÍCULO 4.3.1",null,"1.3"]
["ARTÍCULO 1.5.1","ARTÍCULO 2.3.4","3.3.2.1","4.3.1.1",null,"1.3.1"]
["1.5.1.1","2.3.4.1","ARTÍCULO 3.3.3","4.3.1.2",null,"1.3.2"]
["1.5.1.2","2.3.4.2","3.3.3.1","ARTÍCULO 4.3.2",null,"1.3.3"]
["1.5.1.3","ARTÍCULO 2.3.5","3.3.3.2","4.3.2.1",null,"1.3.4"]
["1.5.1.3.1","ARTÍCULO 2.3.6","3.3.3.3","ARTÍCULO 4.3.3",null,2]
["1.5.1.3.2","ARTÍCULO 2.3.7","3.3.3.4","4.3.3.1",null,3]
["1.5.1.3.3","2.3.7.1","3.3.3.5","ARTÍCULO 4.3.4",null,"3.1"]
["1.5.1.3.4","2.3.7.2","TÍTULO 4","4.3.4.1",null,"a"]
["1.5.1.3.5","ARTÍCULO 2.3.8","TÍTULO 5","TÍTULO 4",null,"b"]
[null,"ARTÍCULO 2.3.9","TÍTULO 6","ARTÍCULO 4.4.1",null,"3.2"]
[null,"ARTÍCULO 2.3.10","TÍTULO 7","4.4.1.1",null,"3.3"]
[null,"ARTÍCULO 2.3.11","TÍTULO 8","4.4.1.2",null,"3.4"]
[null,"ARTÍCULO 2.3.12","ARTÍCULO 3.8.1","4.4.1.3",null,"3.5"]
[null,"ARTÍCULO 2.3.13","TÍTULO 9","4.4.1.4",null,4]
[null,"ARTÍCULO 2.3.14","TÍTULO 10","4.4.1.5",null,"4.1"]
[null,"ARTÍCULO 2.3.15","TÍTULO 11","4.4.1.6",null,"4.2"]
[null,"2.3.15.1","ARTÍCULO 3.11.1","4.4.1.7",null,"4.3"]
[null,"2.3.15.2","ARTÍCULO 3.11.2","4.4.1.8",null,"4.4"]
[null,"ARTÍCULO 2.3.16","ARTÍCULO 3.11.3","ARTÍCULO 4.4.2",null,"4.5"]
[null,"ARTÍCULO 2.3.17","ARTÍCULO 3.11.4","4.4.2.1",null,5]
[null,"2.3.17.1","ARTÍCULO 3.11.5","4.4.2.2",null,6]
[null,"2.3.17.2","TÍTULO 12","4.4.2.3"]
[null,"2.3.17.3","ARTÍCULO 3.12.1","4.4.2.4"]
[null,"ARTÍCULO 2.3.18","ARTÍCULO 3.12.2","4.4.2.5"]
[null,"2.3.18.1","TÍTULO 13","ARTÍCULO 4.4.3"]
{"$rows_left_out":167}
{"sheet":"Contenido RETIE esp","index":2,"n_rows":398,"n_cols":2,"rows_kept":398,"cut":false,"hidden":true,"merged":[[0,0,0,1]]}
["Contenido RETIE especifico"]
["ANEXO1","DISPOSICIONES GENERALES"]
["TÍTULO 1","OBJETO"]
["TÍTULO 2","DEFINICIONES"]
["ARTÍCULO 1.2.1","DEFINICIONES GENERALES"]
["ARTÍCULO 1.2.2","DEFINICIONES RELATIVAS A INSTALACIONES PARA EL CUIDADO DE LA SALUD"]
["TÍTULO 3","ABREVIATURAS, SISTEMA DE UNIDADES Y SEÑALIZACIÓN"]
["ARTÍCULO 1.3.1","ABREVIATURAS, ACRÓNIMOS Y SIGLAS"]
["ARTÍCULO 1.3.2 ","SISTEMA DE UNIDADES"]
["ARTÍCULO 1.3.3","SEÑALIZACIÓN DE SEGURIDAD"]
["1.3.3.1","Objetivo"]
["1.3.3.2","Símbolo de riesgo eléctrico"]
["1.3.3.3","Clasificación de las señales de seguridad"]
["TÍTULO 4","PROGRAMA DE SALUD OCUPACIONAL"]
["TÍTULO 5","REQUISITOS TÉCNICOS PRINCIPALES"]
["ARTÍCULO 1.5.1","ANÁLISIS DE RIESGOS DE ORIGEN ELÉCTRICO"]
["1.5.1.1","Proceso de gestión del riesgo"]
["1.5.1.2","Electropatología"]
["1.5.1.3","Evaluación del nivel de riesgo"]
["1.5.1.3.1","Matriz de análisis de riesgos"]
["1.5.1.3.2","Criterios para determinar alto riesgo"]
["1.5.1.3.3","Factores de riesgo eléctrico más comunes"]
["1.5.1.3.4","Medidas a tomar en situaciones de riesgos"]
["1.5.1.3.5","Notificación de accidentes"]
["ANEXO2","PRODUCTOS"]
["TÍTULO 1","OBJETO Y CAMPO DE APLICACIÓN"]
["ARTÍCULO 2.1.1","OBJETO"]
["ARTÍCULO 2.1.2","CAMPO DE APLICACIÓN"]
["2.1.2.1","PRODUCTOS OBJETO DEL REGLAMENTO"]
["2.1.2.2","EXCEPCIONES"]
["2.1.2.3","EXCLUSIONES"]
["TÍTULO 2","REQUISITOS GENERALES PARA LOS PRODUCTOS USADOS EN LAS INSTALACIONES ELÉCTRICAS"]
["ARTÍCULO 2.2.1","ALCANCE GENERAL DE LA INFORMACIÓN DE PRODUCTOS."]
["ARTÍCULO 2.2.2","DISPOSICIÓN Y ACCESO A LA INFORMACIÓN DE PÚBLICO CONOCIMIENTO"]
["TÍTULO 3","REQUISITOS ESPECÍFICOS PARA LOS PRODUCTOS USADOS EN LAS INSTALACIONES ELÉCTRICAS"]
["ARTÍCULO 2.3.1","AEROGENERADORES"]
["ARTÍCULO 2.3.2","AISLADORES ELÉCTRICOS"]
["ARTÍCULO 2.3.3","BATERÍAS O SISTEMAS DE ACUMULACIÓN ELÉCTRICA"]
["ARTÍCULO 2.3.4","CAJAS Y CONDULETAS"]
["2.3.4.1","CAJAS DE EMPALME, CAJAS PARA INSTALAR APARATOS Y CONDULETAS"]
{"$rows_left_out":358}